{"text_format":"1","workbook":"xlsx","n_sheets":5,"sheets":["WVV 6 auf 11","WVV 7 auf 12","WVV 8 auf 12","WVV 9 auf 12","WVV 7 bzw 8 auf 14 Einzelspiele"],"not_rendered":{"charts":0,"images":3,"macros":0,"external_links":0,"defined_names":9,"comments":0,"pivot_tables":0},"unopened":[],"bounds":{"document_bytes":16777216,"sheet_cells":100000,"rows_first":2000,"rows_last":500,"rows_between":2000,"halvings":0,"cell_chars":16384,"cell_head_chars":4096},"cells_cut":0,"cells_raw":0,"read":"whole","date_system":"1900"}

{"sheet":"WVV 6 auf 11","index":0,"n_rows":66,"n_cols":18,"rows_kept":66,"cut":false,"hidden":false,"merged":[]}
["Spielplan \"6\"",null,null,null,null,"1/2/5/6 zwei Heimspiele","2/5 ein Einzelheimspiel"]
[null,null,null,null,null,"3/4 drei Heimspiele"]
[{"$f":"\"WVV-Spielplan: \"&N3","v":"WVV-Spielplan: Liga x Frauen / Männer"},null,null,null,null,null,"Saison 2021/22",null,null,null,"Seite 1(2)",null,null,"Liga x Frauen / Männer"]
[null,null,null,null,null,null,null,null,null,null,"Halle",null,"1.","23./24. Okt. 2021",2,"X","1","Team 1"]
[{"$f":"\"1.Spieltag, \"&$N$4","v":"1.Spieltag, 23./24. Okt. 2021"},null,null,null,null,null,null,null,null,null,null,null,"2.","30. Okt. 2021 (Sonntag Jugendspieltag)",1,"X","2","Team 2"]
[1,"4-1",">",{"$f":"VLOOKUP(LEFT($B6,1),$Q$4:$R$11,2,FALSE)","v":"Team 4"},"-",{"$f":"VLOOKUP(RIGHT($B6,1),$Q$4:$R$11,2,FALSE)","v":"Team 1"},"Sa/So",null,"__.__","Uhr","__",null,"3.","13./14. Nov. 2021 (Sonntag Volkstrauertag Spielverbot bis 13 Uhr)",3,"X","3","Team 3"]
[{"$f":"A6+1","v":2},"4-2",null,{"$f":"VLOOKUP(LEFT($B7,1),$Q$4:$R$11,2,FALSE)","v":"Team 4"},"-",{"$f":"VLOOKUP(RIGHT($B7,1),$Q$4:$R$11,2,FALSE)","v":"Team 2"},null,null,null,null,null,null,"4.","27./28. Nov. 2021",4,"X","4","Team 4"]
[null,null,null,null,null,null,null,null,null,null,null,null,"5.","11./12. Dez. 2021",5,"X","5","Team 5"]
[{"$f":"\"2.Spieltag, \"&$N$5","v":"2.Spieltag, 30. Okt. 2021 (Sonntag Jugendspieltag)"},null,null,null,null,null,null,null,null,null,null,null,"6.","15./16. Jan. 2022",4,5,"6","Team 6"]
[3,"3-1",">",{"$f":"VLOOKUP(LEFT($B10,1),$Q$4:$R$11,2,FALSE)","v":"Team 3"},"-",{"$f":"VLOOKUP(RIGHT($B10,1),$Q$4:$R$11,2,FALSE)","v":"Team 1"},"Sa",null,"__.__","Uhr","__",null,"7.","29./30. Jan. 2022",3,"X"]
[{"$f":"A10+1","v":4},"3-5",null,{"$f":"VLOOKUP(LEFT($B11,1),$Q$4:$R$11,2,FALSE)","v":"Team 3"},"-",{"$f":"VLOOKUP(RIGHT($B11,1),$Q$4:$R$11,2,FALSE)","v":"Team 5"},null,null,null,null,null,null,"8.","05./06. Feb. 2022",4,"X"]
[5,"6-2",">",{"$f":"VLOOKUP(LEFT($B12,1),$Q$4:$R$11,2,FALSE)","v":"Team 6"},"-",{"$f":"VLOOKUP(RIGHT($B12,1),$Q$4:$R$11,2,FALSE)","v":"Team 2"},"Sa",null,"__.__","Uhr","__",null,"9.","19./20. Feb. 2022",6,"X"]
[6,"6-4",null,{"$f":"VLOOKUP(LEFT($B13,1),$Q$4:$R$11,2,FALSE)","v":"Team 6"},"-",{"$f":"VLOOKUP(RIGHT($B13,1),$Q$4:$R$11,2,FALSE)","v":"Team 4"},null,null,null,null,null,null,"10.","12./13. Mär. 2022",5,"X"]
[null,null,null,null,null,null,null,null,null,null,null,null,"11.","26./27 Mär. 2022",1,"X"]
[{"$f":"\"3.Spieltag, \"&$N$6","v":"3.Spieltag, 13./14. Nov. 2021 (Sonntag Volkstrauertag Spielverbot bis 13 Uhr)"},null,null,null,null,null,null,null,null,null,null,null,null,null,"H","E"]
[7,"2-1",">",{"$f":"VLOOKUP(LEFT($B16,1),$Q$4:$R$11,2,FALSE)","v":"Team 2"},"-",{"$f":"VLOOKUP(RIGHT($B16,1),$Q$4:$R$11,2,FALSE)","v":"Team 1"},"Sa/So",null,"__.__","Uhr","__",null,null,"markieren"]
[8,"5-6",">",{"$f":"VLOOKUP(LEFT($B17,1),$Q$4:$R$11,2,FALSE)","v":"Team 5"},"-",{"$f":"VLOOKUP(RIGHT($B17,1),$Q$4:$R$11,2,FALSE)","v":"Team 6"},"Sa/So",null,"__.__","Uhr","__"]
[9,"5-4",null,{"$f":"VLOOKUP(LEFT($B18,1),$Q$4:$R$11,2,FALSE)","v":"Team 5"},"-",{"$f":"VLOOKUP(RIGHT($B18,1),$Q$4:$R$11,2,FALSE)","v":"Team 4"}]
[]
[{"$f":"\"4.Spieltag, \"&$N$7","v":"4.Spieltag, 27./28. Nov. 2021"}]
[10,"3-4",">",{"$f":"VLOOKUP(LEFT($B21,1),$Q$4:$R$11,2,FALSE)","v":"Team 3"},"-",{"$f":"VLOOKUP(RIGHT($B21,1),$Q$4:$R$11,2,FALSE)","v":"Team 4"},"Sa/So",null,"__.__","Uhr","__"]
[11,"3-6",null,{"$f":"VLOOKUP(LEFT($B22,1),$Q$4:$R$11,2,FALSE)","v":"Team 3"},"-",{"$f":"VLOOKUP(RIGHT($B22,1),$Q$4:$R$11,2,FALSE)","v":"Team 6"}]
[12,"5-1",">",{"$f":"VLOOKUP(LEFT($B23,1),$Q$4:$R$11,2,FALSE)","v":"Team 5"},"-",{"$f":"VLOOKUP(RIGHT($B23,1),$Q$4:$R$11,2,FALSE)","v":"Team 1"},"Sa/So",null,"__.__","Uhr","__"]
[]
[{"$f":"\"5.Spieltag, \"&$N$8","v":"5.Spieltag, 11./12. Dez. 2021"}]
[13,"2-5",">",{"$f":"VLOOKUP(LEFT($B26,1),$Q$4:$R$11,2,FALSE)","v":"Team 2"},"-",{"$f":"VLOOKUP(RIGHT($B26,1),$Q$4:$R$11,2,FALSE)","v":"Team 5"},"Sa/So",null,"__.__","Uhr","__"]
[14,"2-3",null,{"$f":"VLOOKUP(LEFT($B27,1),$Q$4:$R$11,2,FALSE)","v":"Team 2"},"-",{"$f":"VLOOKUP(RIGHT($B27,1),$Q$4:$R$11,2,FALSE)","v":"Team 3"}]
[15,"1-6",">",{"$f":"VLOOKUP(LEFT($B28,1),$Q$4:$R$11,2,FALSE)","v":"Team 1"},"-",{"$f":"VLOOKUP(RIGHT($B28,1),$Q$4:$R$11,2,FALSE)","v":"Team 6"},"Sa/So",null,"__.__","Uhr","__"]
[]
["####   Mit   >   gekennzeichnete Mannschaften haben Heimrecht   ####"]
[]
[{"$f":"A3","v":"WVV-Spielplan: Liga x Frauen / Männer"},null,null,null,null,null,{"$f":"G3","v":"Saison 2021/22"},null,null,null,"Seite 2(2)"]
[null,null,null,null,null,null,null,null,null,null,"Halle"]
[{"$f":"\"6.Spieltag, \"&$N$9","v":"6.Spieltag, 15./16. Jan. 2022"}]
[16,"1-4",">",{"$f":"VLOOKUP(LEFT($B35,1),$Q$4:$R$11,2,FALSE)","v":"Team 1"},"-",{"$f":"VLOOKUP(RIGHT($B35,1),$Q$4:$R$11,2,FALSE)","v":"Team 4"},"Sa/So",null,"__.__","Uhr","__"]
[17,"1-5",null,{"$f":"VLOOKUP(LEFT($B36,1),$Q$4:$R$11,2,FALSE)","v":"Team 1"},"-",{"$f":"VLOOKUP(RIGHT($B36,1),$Q$4:$R$11,2,FALSE)","v":"Team 5"}]
[18,"3-2",">",{"$f":"VLOOKUP(LEFT($B37,1),$Q$4:$R$11,2,FALSE)","v":"Team 3"},"-",{"$f":"VLOOKUP(RIGHT($B37,1),$Q$4:$R$11,2,FALSE)","v":"Team 2"},"Sa/So",null,"__.__","Uhr","__"]
[]
[{"$f":"\"7.Spieltag, \"&$N$10","v":"7.Spieltag, 29./30. Jan. 2022"}]
[19,"6-5",">",{"$f":"VLOOKUP(LEFT($B40,1),$Q$4:$R$11,2,FALSE)","v":"Team 6"},"-",{"$f":"VLOOKUP(RIGHT($B40,1),$Q$4:$R$11,2,FALSE)","v":"Team 5"},"Sa/So",null,"__.__","Uhr","__"]
[20,"6-3",null,{"$f":"VLOOKUP(LEFT($B41,1),$Q$4:$R$11,2,FALSE)","v":"Team 6"},"-",{"$f":"VLOOKUP(RIGHT($B41,1),$Q$4:$R$11,2,FALSE)","v":"Team 3"}]
[]
[{"$f":"\"8.Spieltag, \"&$N$11","v":"8.Spieltag, 05./06. Feb. 2022"}]
[21,"1-3",">",{"$f":"VLOOKUP(LEFT($B44,1),$Q$4:$R$11,2,FALSE)","v":"Team 1"},"-",{"$f":"VLOOKUP(RIGHT($B44,1),$Q$4:$R$11,2,FALSE)","v":"Team 3"},"Sa/So",null,"__.__","Uhr","__"]
[22,"1-2",">",{"$f":"VLOOKUP(LEFT($B45,1),$Q$4:$R$11,2,FALSE)","v":"Team 1"},"-",{"$f":"VLOOKUP(RIGHT($B45,1),$Q$4:$R$11,2,FALSE)","v":"Team 2"}]
[23,"4-6",null,{"$f":"VLOOKUP(LEFT($B46,1),$Q$4:$R$11,2,FALSE)","v":"Team 4"},"-",{"$f":"VLOOKUP(RIGHT($B46,1),$Q$4:$R$11,2,FALSE)","v":"Team 6"},"Sa/So",null,"__.__","Uhr","__"]
[]
[{"$f":"\"9.Spieltag, \"&$N$12","v":"9.Spieltag, 19./20. Feb. 2022"}]
[24,"5-2",">",{"$f":"VLOOKUP(LEFT($B49,1),$Q$4:$R$11,2,FALSE)","v":"Team 5"},"-",{"$f":"VLOOKUP(RIGHT($B49,1),$Q$4:$R$11,2,FALSE)","v":"Team 2"},"Sa/So",null,"__.__","Uhr","__"]
[25,"5-3",null,{"$f":"VLOOKUP(LEFT($B50,1),$Q$4:$R$11,2,FALSE)","v":"Team 5"},"-",{"$f":"VLOOKUP(RIGHT($B50,1),$Q$4:$R$11,2,FALSE)","v":"Team 3"}]
[]
[{"$f":"\"10.Spieltag, \"&$N$13","v":"10.Spieltag, 12./13. Mär. 2022"}]
[26,"2-6",">",{"$f":"VLOOKUP(LEFT($B53,1),$Q$4:$R$11,2,FALSE)","v":"Team 2"},"-",{"$f":"VLOOKUP(RIGHT($B53,1),$Q$4:$R$11,2,FALSE)","v":"Team 6"},"Sa/So",null,"__.__","Uhr","__"]
[27,"2-4",null,{"$f":"VLOOKUP(LEFT($B54,1),$Q$4:$R$11,2,FALSE)","v":"Team 2"},"-",{"$f":"VLOOKUP(RIGHT($B54,1),$Q$4:$R$11,2,FALSE)","v":"Team 4"}]
[]
[{"$f":"\"11.Spieltag, \"&$N$14","v":"11.Spieltag, 26./27 Mär. 2022"}]
[28,"4-3",">",{"$f":"VLOOKUP(LEFT($B57,1),$Q$4:$R$11,2,FALSE)","v":"Team 4"},"-",{"$f":"VLOOKUP(RIGHT($B57,1),$Q$4:$R$11,2,FALSE)","v":"Team 3"},"Sa/So",null,"__.__","Uhr","__"]
[29,"4-5",null,{"$f":"VLOOKUP(LEFT($B58,1),$Q$4:$R$11,2,FALSE)","v":"Team 4"},"-",{"$f":"VLOOKUP(RIGHT($B58,1),$Q$4:$R$11,2,FALSE)","v":"Team 5"}]
[30,"6-1",">",{"$f":"VLOOKUP(LEFT($B59,1),$Q$4:$R$11,2,FALSE)","v":"Team 6"},"-",{"$f":"VLOOKUP(RIGHT($B59,1),$Q$4:$R$11,2,FALSE)","v":"Team 1"},"Sa/So",null,"__.__","Uhr","__"]
[]
["####   Mit   >   gekennzeichnete Mannschaften haben Heimrecht   ####"]
[]
[]
[]
[]
[null,null,null,null,null,null,null,null,null,null," "]

{"sheet":"WVV 7 auf 12","index":1,"n_rows":80,"n_cols":18,"rows_kept":80,"cut":false,"hidden":false,"merged":[]}
["Spielplan \"7\"",null,null,null,null,"alle 2 Heimspiele",null,"2&4=> ein Verein"]
[null,null,null,null,null,"alle 2 Einzelspiele"]
[{"$f":"\"WVV-Spielplan: \"&N3","v":"WVV-Spielplan: Liga x Frauen / Männer"},null,null,null,null,null,"Saison 2021/22",null,null,null,"Seite 1(2)",null,null,"Liga x Frauen / Männer"]
[null,null,null,null,null,null,null,null,null,null,"Halle",null,"1.","23./24. Okt. 2021",2,1,"1","Team 1"]
[{"$f":"\"1.Spieltag, \"&$N$4","v":"1.Spieltag, 23./24. Okt. 2021"},null,null,null,null,null,null,null,null,null,null,null,"2.","30. Okt. 2021 (Sonntag Jugendspieltag)",5,7,"2","Team 2"]
[1,"4-1",">",{"$f":"VLOOKUP(LEFT($B6,1),$Q$4:$R$11,2,FALSE)","v":"Team 4"},"-",{"$f":"VLOOKUP(RIGHT($B6,1),$Q$4:$R$11,2,FALSE)","v":"Team 1"},"Sa/So",null,"__.__","Uhr","__",null,"3.","13./14. Nov. 2021 (Sonntag Volkstrauertag Spielverbot bis 13 Uhr)",3,6,"3","Team 3"]
[2,"4-2",">",{"$f":"VLOOKUP(LEFT($B7,1),$Q$4:$R$11,2,FALSE)","v":"Team 4"},"-",{"$f":"VLOOKUP(RIGHT($B7,1),$Q$4:$R$11,2,FALSE)","v":"Team 2"},null,null,null,null,null,null,"4.","27./28. Nov. 2021",4,2,"4","Team 4"]
[3,"7-3",">",{"$f":"VLOOKUP(LEFT($B8,1),$Q$4:$R$11,2,FALSE)","v":"Team 7"},"-",{"$f":"VLOOKUP(RIGHT($B8,1),$Q$4:$R$11,2,FALSE)","v":"Team 3"},"Sa/So",null,"__.__","Uhr","__",null,"5.","11./12. Dez. 2021",1,3,"5","Team 5"]
[4,"7-6",null,{"$f":"VLOOKUP(LEFT($B9,1),$Q$4:$R$11,2,FALSE)","v":"Team 7"},"-",{"$f":"VLOOKUP(RIGHT($B9,1),$Q$4:$R$11,2,FALSE)","v":"Team 6"},null,null,null,null,null,null,"6.","19. Dez. 2021 (Samstag Jugendspieltag)",6,4,"6","Team 6"]
[null,null,null,null,null,null,null,null,null,null,null,null,"7.","15./16. Jan. 2022",7,5,"7","Team 7"]
[{"$f":"\"2.Spieltag, \"&$N$5","v":"2.Spieltag, 30. Okt. 2021 (Sonntag Jugendspieltag)"},null,null,null,null,null,null,null,null,null,null,null,"8.","29./30. Jan. 2022",4,7]
[5,"3-1",">",{"$f":"VLOOKUP(LEFT($B12,1),$Q$4:$R$11,2,FALSE)","v":"Team 3"},"-",{"$f":"VLOOKUP(RIGHT($B12,1),$Q$4:$R$11,2,FALSE)","v":"Team 1"},"Sa",null,"__.__","Uhr","__",null,"9.","05./06. Feb. 2022",1,2]
[6,"3-5",null,{"$f":"VLOOKUP(LEFT($B13,1),$Q$4:$R$11,2,FALSE)","v":"Team 3"},"-",{"$f":"VLOOKUP(RIGHT($B13,1),$Q$4:$R$11,2,FALSE)","v":"Team 5"},null,null,null,null,null,null,"10.","19./20. Feb. 2022",2,1]
[7,"6-2",">",{"$f":"VLOOKUP(LEFT($B14,1),$Q$4:$R$11,2,FALSE)","v":"Team 6"},"-",{"$f":"VLOOKUP(RIGHT($B14,1),$Q$4:$R$11,2,FALSE)","v":"Team 2"},"Sa",null,"__.__","Uhr","__",null,"11.","12./13. Mär. 2022",6,5]
[8,"6-4",null,{"$f":"VLOOKUP(LEFT($B15,1),$Q$4:$R$11,2,FALSE)","v":"Team 6"},"-",{"$f":"VLOOKUP(RIGHT($B15,1),$Q$4:$R$11,2,FALSE)","v":"Team 4"},null,null,null,null,null,null,"12.","26./27 Mär. 2022",5,6]
[null,null,null,null,null,null,null,null,null,null,null,null,null,null,"H","E"]
[{"$f":"\"3.Spieltag, \"&$N$6","v":"3.Spieltag, 13./14. Nov. 2021 (Sonntag Volkstrauertag Spielverbot bis 13 Uhr)"},null,null,null,null,null,null,null,null,null,null,null,null,"markieren"]
[9,"2-1",">",{"$f":"VLOOKUP(LEFT($B18,1),$Q$4:$R$11,2,FALSE)","v":"Team 2"},"-",{"$f":"VLOOKUP(RIGHT($B18,1),$Q$4:$R$11,2,FALSE)","v":"Team 1"},"Sa/So",null,"__.__","Uhr","__"]
[10,"2-7",null,{"$f":"VLOOKUP(LEFT($B19,1),$Q$4:$R$11,2,FALSE)","v":"Team 2"},"-",{"$f":"VLOOKUP(RIGHT($B19,1),$Q$4:$R$11,2,FALSE)","v":"Team 7"}]
[11,"5-6",">",{"$f":"VLOOKUP(LEFT($B20,1),$Q$4:$R$11,2,FALSE)","v":"Team 5"},"-",{"$f":"VLOOKUP(RIGHT($B20,1),$Q$4:$R$11,2,FALSE)","v":"Team 6"},"Sa/So",null,"__.__","Uhr","__"]
[12,"5-4",null,{"$f":"VLOOKUP(LEFT($B21,1),$Q$4:$R$11,2,FALSE)","v":"Team 5"},"-",{"$f":"VLOOKUP(RIGHT($B21,1),$Q$4:$R$11,2,FALSE)","v":"Team 4"}]
[]
[{"$f":"\"4.Spieltag, \"&$N$7","v":"4.Spieltag, 27./28. Nov. 2021"}]
[13,"3-4",">",{"$f":"VLOOKUP(LEFT($B24,1),$Q$4:$R$11,2,FALSE)","v":"Team 3"},"-",{"$f":"VLOOKUP(RIGHT($B24,1),$Q$4:$R$11,2,FALSE)","v":"Team 4"},"Sa/So",null,"__.__","Uhr","__"]
[14,"3-6",null,{"$f":"VLOOKUP(LEFT($B25,1),$Q$4:$R$11,2,FALSE)","v":"Team 3"},"-",{"$f":"VLOOKUP(RIGHT($B25,1),$Q$4:$R$11,2,FALSE)","v":"Team 6"}]
[15,"5-7",">",{"$f":"VLOOKUP(LEFT($B26,1),$Q$4:$R$11,2,FALSE)","v":"Team 5"},"-",{"$f":"VLOOKUP(RIGHT($B26,1),$Q$4:$R$11,2,FALSE)","v":"Team 7"},"Sa/So",null,"__.__","Uhr","__"]
[16,"5-1",null,{"$f":"VLOOKUP(LEFT($B27,1),$Q$4:$R$11,2,FALSE)","v":"Team 5"},"-",{"$f":"VLOOKUP(RIGHT($B27,1),$Q$4:$R$11,2,FALSE)","v":"Team 1"}]
[]
[{"$f":"\"5.Spieltag, \"&$N$8","v":"5.Spieltag, 11./12. Dez. 2021"}]
[17,"2-5",">",{"$f":"VLOOKUP(LEFT($B30,1),$Q$4:$R$11,2,FALSE)","v":"Team 2"},"-",{"$f":"VLOOKUP(RIGHT($B30,1),$Q$4:$R$11,2,FALSE)","v":"Team 5"},"Sa/So",null,"__.__","Uhr","__"]
[18,"2-3",null,{"$f":"VLOOKUP(LEFT($B31,1),$Q$4:$R$11,2,FALSE)","v":"Team 2"},"-",{"$f":"VLOOKUP(RIGHT($B31,1),$Q$4:$R$11,2,FALSE)","v":"Team 3"}]
[19,"1-6",">",{"$f":"VLOOKUP(LEFT($B32,1),$Q$4:$R$11,2,FALSE)","v":"Team 1"},"-",{"$f":"VLOOKUP(RIGHT($B32,1),$Q$4:$R$11,2,FALSE)","v":"Team 6"},"Sa/So",null,"__.__","Uhr","__"]
[20,"1-7",null,{"$f":"VLOOKUP(LEFT($B33,1),$Q$4:$R$11,2,FALSE)","v":"Team 1"},"-",{"$f":"VLOOKUP(RIGHT($B33,1),$Q$4:$R$11,2,FALSE)","v":"Team 7"}]
[]
[{"$f":"\"6.Spieltag, \"&$N$9","v":"6.Spieltag, 19. Dez. 2021 (Samstag Jugendspieltag)"}]
[21,"7-4",">",{"$f":"VLOOKUP(LEFT($B36,1),$Q$4:$R$11,2,FALSE)","v":"Team 7"},"-",{"$f":"VLOOKUP(RIGHT($B36,1),$Q$4:$R$11,2,FALSE)","v":"Team 4"},null,"So","__.__","Uhr","__"]
[22,"7-2",null,{"$f":"VLOOKUP(LEFT($B37,1),$Q$4:$R$11,2,FALSE)","v":"Team 7"},"-",{"$f":"VLOOKUP(RIGHT($B37,1),$Q$4:$R$11,2,FALSE)","v":"Team 2"}]
[]
["####   Mit   >   gekennzeichnete Mannschaften haben Heimrecht   ####"]
[]
[{"$f":"A3","v":"WVV-Spielplan: Liga x Frauen / Männer"},null,null,null,null,null,{"$f":"G3","v":"Saison 2021/22"},null,null,null,"Seite 2(2)"]
[null,null,null,null,null,null,null,null,null,null,"Halle"]
[{"$f":"\"7.Spieltag, \"&$N$10","v":"7.Spieltag, 15./16. Jan. 2022"}]
[23,"1-4",">",{"$f":"VLOOKUP(LEFT($B44,1),$Q$4:$R$11,2,FALSE)","v":"Team 1"},"-",{"$f":"VLOOKUP(RIGHT($B44,1),$Q$4:$R$11,2,FALSE)","v":"Team 4"},"Sa/So",null,"__.__","Uhr","__"]
[24,"1-5",null,{"$f":"VLOOKUP(LEFT($B45,1),$Q$4:$R$11,2,FALSE)","v":"Team 1"},"-",{"$f":"VLOOKUP(RIGHT($B45,1),$Q$4:$R$11,2,FALSE)","v":"Team 5"}]
[25,"3-7",">",{"$f":"VLOOKUP(LEFT($B46,1),$Q$4:$R$11,2,FALSE)","v":"Team 3"},"-",{"$f":"VLOOKUP(RIGHT($B46,1),$Q$4:$R$11,2,FALSE)","v":"Team 7"},"Sa/So",null,"__.__","Uhr","__"]
[26,"3-2",null,{"$f":"VLOOKUP(LEFT($B47,1),$Q$4:$R$11,2,FALSE)","v":"Team 3"},"-",{"$f":"VLOOKUP(RIGHT($B47,1),$Q$4:$R$11,2,FALSE)","v":"Team 2"}]
[]
[{"$f":"\"8.Spieltag, \"&$N$11","v":"8.Spieltag, 29./30. Jan. 2022"}]
[27,"6-5",">",{"$f":"VLOOKUP(LEFT($B50,1),$Q$4:$R$11,2,FALSE)","v":"Team 6"},"-",{"$f":"VLOOKUP(RIGHT($B50,1),$Q$4:$R$11,2,FALSE)","v":"Team 5"},"Sa/So",null,"__.__","Uhr","__"]
[28,"6-3",null,{"$f":"VLOOKUP(LEFT($B51,1),$Q$4:$R$11,2,FALSE)","v":"Team 6"},"-",{"$f":"VLOOKUP(RIGHT($B51,1),$Q$4:$R$11,2,FALSE)","v":"Team 3"}]
[]
[{"$f":"\"9.Spieltag, \"&$N$12","v":"9.Spieltag, 05./06. Feb. 2022"}]
[29,"1-3",">",{"$f":"VLOOKUP(LEFT($B54,1),$Q$4:$R$11,2,FALSE)","v":"Team 1"},"-",{"$f":"VLOOKUP(RIGHT($B54,1),$Q$4:$R$11,2,FALSE)","v":"Team 3"},"Sa/So",null,"__.__","Uhr","__"]
[30,"1-2",">",{"$f":"VLOOKUP(LEFT($B55,1),$Q$4:$R$11,2,FALSE)","v":"Team 1"},"-",{"$f":"VLOOKUP(RIGHT($B55,1),$Q$4:$R$11,2,FALSE)","v":"Team 2"}]
[31,"4-7",">",{"$f":"VLOOKUP(LEFT($B56,1),$Q$4:$R$11,2,FALSE)","v":"Team 4"},"-",{"$f":"VLOOKUP(RIGHT($B56,1),$Q$4:$R$11,2,FALSE)","v":"Team 7"},"Sa/So",null,"__.__","Uhr","__"]
[32,"4-6",null,{"$f":"VLOOKUP(LEFT($B57,1),$Q$4:$R$11,2,FALSE)","v":"Team 4"},"-",{"$f":"VLOOKUP(RIGHT($B57,1),$Q$4:$R$11,2,FALSE)","v":"Team 6"}]
[]
[{"$f":"\"10.Spieltag, \"&$N$13","v":"10.Spieltag, 19./20. Feb. 2022"}]
[33,"5-2",">",{"$f":"VLOOKUP(LEFT($B60,1),$Q$4:$R$11,2,FALSE)","v":"Team 5"},"-",{"$f":"VLOOKUP(RIGHT($B60,1),$Q$4:$R$11,2,FALSE)","v":"Team 2"},"Sa/So",null,"__.__","Uhr","__"]
[34,"5-3",null,{"$f":"VLOOKUP(LEFT($B61,1),$Q$4:$R$11,2,FALSE)","v":"Team 5"},"-",{"$f":"VLOOKUP(RIGHT($B61,1),$Q$4:$R$11,2,FALSE)","v":"Team 3"}]
[]
[{"$f":"\"11.Spieltag, \"&$N$14","v":"11.Spieltag, 12./13. Mär. 2022"}]
[35,"2-6",">",{"$f":"VLOOKUP(LEFT($B64,1),$Q$4:$R$11,2,FALSE)","v":"Team 2"},"-",{"$f":"VLOOKUP(RIGHT($B64,1),$Q$4:$R$11,2,FALSE)","v":"Team 6"},"Sa/So",null,"__.__","Uhr","__"]
[36,"2-4",null,{"$f":"VLOOKUP(LEFT($B65,1),$Q$4:$R$11,2,FALSE)","v":"Team 2"},"-",{"$f":"VLOOKUP(RIGHT($B65,1),$Q$4:$R$11,2,FALSE)","v":"Team 4"}]
[37,"7-5",">",{"$f":"VLOOKUP(LEFT($B66,1),$Q$4:$R$11,2,FALSE)","v":"Team 7"},"-",{"$f":"VLOOKUP(RIGHT($B66,1),$Q$4:$R$11,2,FALSE)","v":"Team 5"},"Sa/So",null,"__.__","Uhr","__"]
[38,"7-1",null,{"$f":"VLOOKUP(LEFT($B67,1),$Q$4:$R$11,2,FALSE)","v":"Team 7"},"-",{"$f":"VLOOKUP(RIGHT($B67,1),$Q$4:$R$11,2,FALSE)","v":"Team 1"}]
[]
[{"$f":"\"12.Spieltag, \"&$N$15","v":"12.Spieltag, 26./27 Mär. 2022"}]
[39,"4-3",">",{"$f":"VLOOKUP(LEFT($B70,1),$Q$4:$R$11,2,FALSE)","v":"Team 4"},"-",{"$f":"VLOOKUP(RIGHT($B70,1),$Q$4:$R$11,2,FALSE)","v":"Team 3"},"Sa/So",null,"__.__","Uhr","__"]
[40,"4-5",null,{"$f":"VLOOKUP(LEFT($B71,1),$Q$4:$R$11,2,FALSE)","v":"Team 4"},"-",{"$f":"VLOOKUP(RIGHT($B71,1),$Q$4:$R$11,2,FALSE)","v":"Team 5"}]
[41,"6-1",">",{"$f":"VLOOKUP(LEFT($B72,1),$Q$4:$R$11,2,FALSE)","v":"Team 6"},"-",{"$f":"VLOOKUP(RIGHT($B72,1),$Q$4:$R$11,2,FALSE)","v":"Team 1"},"Sa/So",null,"__.__","Uhr","__"]
[42,"6-7",null,{"$f":"VLOOKUP(LEFT($B73,1),$Q$4:$R$11,2,FALSE)","v":"Team 6"},"-",{"$f":"VLOOKUP(RIGHT($B73,1),$Q$4:$R$11,2,FALSE)","v":"Team 7"}]
[]
["####   Mit   >   gekennzeichnete Mannschaften haben Heimrecht   ####"]
[]
[]
[]
[]
[null,null,null,null,null,null,null,null,null,null," "]

{"sheet":"WVV 8 auf 12","index":2,"n_rows":90,"n_cols":19,"rows_kept":90,"cut":false,"hidden":false,"merged":[]}
[null,"Spielplan \"8\"",null,null,null,null,"1/2/5/8=> 3HSp",null,"1&7=> ein Verein"]
[null,null,null,null,null,null,"3/4/6/7=> 4HSp",null,"2&4=> ein Verein"]
["2&4=> 13.SpT !!!",null,null,null,null,null,"2&4=> 5./12.SpT !!!","1&7=> 13.SpT !!!"]
[null,{"$f":"\"WVV-Spielplan: \"&O4","v":"WVV-Spielplan: Liga x Frauen / Männer"},null,null,null,null,null,"Saison 2021/22",null,null,null,"Seite 1(2)",null,null,"Liga x Frauen / Männer"]
[null,null,null,null,null,null,null,null,null,null,null,"Halle",null,"1.","23./24. Okt. 2021",1,2,"1","Team 1"]
[null,{"$f":"\"1.Spieltag, \"&$O$5","v":"1.Spieltag, 23./24. Okt. 2021"},null,null,null,null,null,null,null,null,null,null,null,"2.","30. Okt. 2021 (Sonntag Jugendspieltag)",5,8,"2","Team 2"]
[null,1,"1-5",">",{"$f":"VLOOKUP(LEFT($C7,1),$R$5:$S$12,2,FALSE)","v":"Team 1"},"-",{"$f":"VLOOKUP(RIGHT($C7,1),$R$5:$S$12,2,FALSE)","v":"Team 5"},"Sa/So",null,"__.__","Uhr","__",null,"3.","13./14. Nov. 2021 (Sonntag Volkstrauertag Spielverbot bis 13 Uhr)",3,6,"3","Team 3"]
["1-7",2,"4-8",">",{"$f":"VLOOKUP(LEFT($C8,1),$R$5:$S$12,2,FALSE)","v":"Team 4"},"-",{"$f":"VLOOKUP(RIGHT($C8,1),$R$5:$S$12,2,FALSE)","v":"Team 8"},"Sa/So",null,"__.__","Uhr","__",null,"4.","27./28. Nov. 2021",4,7,"4","Team 4"]
["5-6",3,"4-3",null,{"$f":"VLOOKUP(LEFT($C9,1),$R$5:$S$12,2,FALSE)","v":"Team 4"},"-",{"$f":"VLOOKUP(RIGHT($C9,1),$R$5:$S$12,2,FALSE)","v":"Team 3"},null,null,null,null,null,null,"5.","11./12. Dez. 2021",1,8,"5","Team 5"]
["2-4",4,"7-2",">",{"$f":"VLOOKUP(LEFT($C10,1),$R$5:$S$12,2,FALSE)","v":"Team 7"},"-",{"$f":"VLOOKUP(RIGHT($C10,1),$R$5:$S$12,2,FALSE)","v":"Team 2"},"Sa/So",null,"__.__","Uhr","__",null,"6.","19. Dez. 2021 (Samstag Jugendspieltag)",3,6,"6","Team 6"]
["3-8",5,"7-6",null,{"$f":"VLOOKUP(LEFT($C11,1),$R$5:$S$12,2,FALSE)","v":"Team 7"},"-",{"$f":"VLOOKUP(RIGHT($C11,1),$R$5:$S$12,2,FALSE)","v":"Team 6"},null,null,null,null,null,null,"7.","15./16. Jan. 2022",4,7,"7","Team 7"]
[null,null,null,null,null,null,null,null,null,null,null,null,null,"8.","29./30. Jan. 2022",4,7,"8","Team 8"]
[null,{"$f":"\"2.Spieltag, \"&$O$6","v":"2.Spieltag, 30. Okt. 2021 (Sonntag Jugendspieltag)"},null,null,null,null,null,null,null,null,null,null,null,"9.","05./06. Feb. 2022",3,6]
["5-3",6,"3-1",">",{"$f":"VLOOKUP(LEFT($C14,1),$R$5:$S$12,2,FALSE)","v":"Team 3"},"-",{"$f":"VLOOKUP(RIGHT($C14,1),$R$5:$S$12,2,FALSE)","v":"Team 1"},"Sa",null,"__.__","Uhr","__",null,"10.","19./20. Feb. 2022",1,2]
["4-1",7,"3-8",null,{"$f":"VLOOKUP(LEFT($C15,1),$R$5:$S$12,2,FALSE)","v":"Team 3"},"-",{"$f":"VLOOKUP(RIGHT($C15,1),$R$5:$S$12,2,FALSE)","v":"Team 8"},null,null,null,null,null,null,"11.","12./13. Mär. 2022",6,8]
["8-6",8,"6-4",">",{"$f":"VLOOKUP(LEFT($C16,1),$R$5:$S$12,2,FALSE)","v":"Team 6"},"-",{"$f":"VLOOKUP(RIGHT($C16,1),$R$5:$S$12,2,FALSE)","v":"Team 4"},"Sa",null,"__.__","Uhr","__",null,"12.","26./27 Mär. 2022",2,5]
["7-2",9,"6-2",null,{"$f":"VLOOKUP(LEFT($C17,1),$R$5:$S$12,2,FALSE)","v":"Team 6"},"-",{"$f":"VLOOKUP(RIGHT($C17,1),$R$5:$S$12,2,FALSE)","v":"Team 2"},null,null,null,null,null,null,null,null,"H","H"]
[null,null,null,null,null,null,null,null,null,null,null,null,null,null,"markieren"]
[null,{"$f":"\"3.Spieltag, \"&$O$7","v":"3.Spieltag, 13./14. Nov. 2021 (Sonntag Volkstrauertag Spielverbot bis 13 Uhr)"}]
[null,10,"2-1",">",{"$f":"VLOOKUP(LEFT($C20,1),$R$5:$S$12,2,FALSE)","v":"Team 2"},"-",{"$f":"VLOOKUP(RIGHT($C20,1),$R$5:$S$12,2,FALSE)","v":"Team 1"},"Sa/So",null,"__.__","Uhr","__"]
["6-1",11,"5-3",">",{"$f":"VLOOKUP(LEFT($C21,1),$R$5:$S$12,2,FALSE)","v":"Team 5"},"-",{"$f":"VLOOKUP(RIGHT($C21,1),$R$5:$S$12,2,FALSE)","v":"Team 3"},"Sa/So",null,"__.__","Uhr","__"]
["5-7",12,"5-4",null,{"$f":"VLOOKUP(LEFT($C22,1),$R$5:$S$12,2,FALSE)","v":"Team 5"},"-",{"$f":"VLOOKUP(RIGHT($C22,1),$R$5:$S$12,2,FALSE)","v":"Team 4"}]
["3-2",13,"8-6",">",{"$f":"VLOOKUP(LEFT($C23,1),$R$5:$S$12,2,FALSE)","v":"Team 8"},"-",{"$f":"VLOOKUP(RIGHT($C23,1),$R$5:$S$12,2,FALSE)","v":"Team 6"},"Sa/So",null,"__.__","Uhr","__"]
["8-4",14,"8-7",null,{"$f":"VLOOKUP(LEFT($C24,1),$R$5:$S$12,2,FALSE)","v":"Team 8"},"-",{"$f":"VLOOKUP(RIGHT($C24,1),$R$5:$S$12,2,FALSE)","v":"Team 7"}]
[]
[null,{"$f":"\"4.Spieltag, \"&$O$8","v":"4.Spieltag, 27./28. Nov. 2021"}]
["7-8",15,"4-1",">",{"$f":"VLOOKUP(LEFT($C27,1),$R$5:$S$12,2,FALSE)","v":"Team 4"},"-",{"$f":"VLOOKUP(RIGHT($C27,1),$R$5:$S$12,2,FALSE)","v":"Team 1"},"Sa/So",null,"__.__","Uhr","__"]
["2-5",16,"3-2",">",{"$f":"VLOOKUP(LEFT($C28,1),$R$5:$S$12,2,FALSE)","v":"Team 3"},"-",{"$f":"VLOOKUP(RIGHT($C28,1),$R$5:$S$12,2,FALSE)","v":"Team 2"},"Sa/So",null,"__.__","Uhr","__"]
["4-6",17,"3-6",null,{"$f":"VLOOKUP(LEFT($C29,1),$R$5:$S$12,2,FALSE)","v":"Team 3"},"-",{"$f":"VLOOKUP(RIGHT($C29,1),$R$5:$S$12,2,FALSE)","v":"Team 6"}]
["1-3",18,"5-7",">",{"$f":"VLOOKUP(LEFT($C30,1),$R$5:$S$12,2,FALSE)","v":"Team 5"},"-",{"$f":"VLOOKUP(RIGHT($C30,1),$R$5:$S$12,2,FALSE)","v":"Team 7"},"Sa/So",null,"__.__","Uhr","__"]
[null,19,"5-8",null,{"$f":"VLOOKUP(LEFT($C31,1),$R$5:$S$12,2,FALSE)","v":"Team 5"},"-",{"$f":"VLOOKUP(RIGHT($C31,1),$R$5:$S$12,2,FALSE)","v":"Team 8"}]
[]
[null,{"$f":"\"5.Spieltag, \"&$O$9","v":"5.Spieltag, 11./12. Dez. 2021"}]
["8-2",20,"2-4",">",{"$f":"VLOOKUP(LEFT($C34,1),$R$5:$S$12,2,FALSE)","v":"Team 2"},"-",{"$f":"VLOOKUP(RIGHT($C34,1),$R$5:$S$12,2,FALSE)","v":"Team 4"},"Sa/So",null,"__.__","Uhr","__"]
["7-4",21,"2-5",null,{"$f":"VLOOKUP(LEFT($C35,1),$R$5:$S$12,2,FALSE)","v":"Team 2"},"-",{"$f":"VLOOKUP(RIGHT($C35,1),$R$5:$S$12,2,FALSE)","v":"Team 5"}]
["1-5",22,"1-6",">",{"$f":"VLOOKUP(LEFT($C36,1),$R$5:$S$12,2,FALSE)","v":"Team 1"},"-",{"$f":"VLOOKUP(RIGHT($C36,1),$R$5:$S$12,2,FALSE)","v":"Team 6"},"Sa/So",null,"__.__","Uhr","__"]
["6-3",23,"1-7",null,{"$f":"VLOOKUP(LEFT($C37,1),$R$5:$S$12,2,FALSE)","v":"Team 1"},"-",{"$f":"VLOOKUP(RIGHT($C37,1),$R$5:$S$12,2,FALSE)","v":"Team 7"}]
[]
[null,{"$f":"\"6.Spieltag, \"&$O$10","v":"6.Spieltag, 19. Dez. 2021 (Samstag Jugendspieltag)"}]
[null,24,"6-5",">",{"$f":"VLOOKUP(LEFT($C40,1),$R$5:$S$12,2,FALSE)","v":"Team 6"},"-",{"$f":"VLOOKUP(RIGHT($C40,1),$R$5:$S$12,2,FALSE)","v":"Team 5"},null,"So","__.__","Uhr","__"]
["3-4",25,"7-3",">",{"$f":"VLOOKUP(LEFT($C41,1),$R$5:$S$12,2,FALSE)","v":"Team 7"},"-",{"$f":"VLOOKUP(RIGHT($C41,1),$R$5:$S$12,2,FALSE)","v":"Team 3"},null,"So","__.__","Uhr","__"]
["8-5",26,"7-4",null,{"$f":"VLOOKUP(LEFT($C42,1),$R$5:$S$12,2,FALSE)","v":"Team 7"},"-",{"$f":"VLOOKUP(RIGHT($C42,1),$R$5:$S$12,2,FALSE)","v":"Team 4"}]
["6-7",27,"8-1",">",{"$f":"VLOOKUP(LEFT($C43,1),$R$5:$S$12,2,FALSE)","v":"Team 8"},"-",{"$f":"VLOOKUP(RIGHT($C43,1),$R$5:$S$12,2,FALSE)","v":"Team 1"},null,"So","__.__","Uhr","__"]
["2-1",28,"8-2",null,{"$f":"VLOOKUP(LEFT($C44,1),$R$5:$S$12,2,FALSE)","v":"Team 8"},"-",{"$f":"VLOOKUP(RIGHT($C44,1),$R$5:$S$12,2,FALSE)","v":"Team 2"}]
[]
[null,"####   Mit   >   gekennzeichnete Mannschaften haben Heimrecht   ####"]
[]
[null,{"$f":"B4","v":"WVV-Spielplan: Liga x Frauen / Männer"},null,null,null,null,null,{"$f":"H4","v":"Saison 2021/22"},null,null,null,"Seite 2(2)"]
[null,null,null,null,null,null,null,null,null,null,null,"Halle"]
[null,{"$f":"\"7.Spieltag, \"&$O$11","v":"7.Spieltag, 15./16. Jan. 2022"}]
[null,29,"5-1",">",{"$f":"VLOOKUP(LEFT($C51,1),$R$5:$S$12,2,FALSE)","v":"Team 5"},"-",{"$f":"VLOOKUP(RIGHT($C51,1),$R$5:$S$12,2,FALSE)","v":"Team 1"},"Sa/So",null,"__.__","Uhr","__"]
["4-5",30,"2-7",">",{"$f":"VLOOKUP(LEFT($C52,1),$R$5:$S$12,2,FALSE)","v":"Team 2"},"-",{"$f":"VLOOKUP(RIGHT($C52,1),$R$5:$S$12,2,FALSE)","v":"Team 7"},"Sa/So",null,"__.__","Uhr","__"]
["1-8",31,"2-6",null,{"$f":"VLOOKUP(LEFT($C53,1),$R$5:$S$12,2,FALSE)","v":"Team 2"},"-",{"$f":"VLOOKUP(RIGHT($C53,1),$R$5:$S$12,2,FALSE)","v":"Team 6"}]
["7-3",32,"8-4",">",{"$f":"VLOOKUP(LEFT($C54,1),$R$5:$S$12,2,FALSE)","v":"Team 8"},"-",{"$f":"VLOOKUP(RIGHT($C54,1),$R$5:$S$12,2,FALSE)","v":"Team 4"},"Sa/So",null,"__.__","Uhr","__"]
["2-6",33,"8-3",null,{"$f":"VLOOKUP(LEFT($C55,1),$R$5:$S$12,2,FALSE)","v":"Team 8"},"-",{"$f":"VLOOKUP(RIGHT($C55,1),$R$5:$S$12,2,FALSE)","v":"Team 3"}]
[]
[null,{"$f":"\"8.Spieltag, \"&$O$12","v":"8.Spieltag, 29./30. Jan. 2022"}]
["7-1",34,"3-5",">",{"$f":"VLOOKUP(LEFT($C58,1),$R$5:$S$12,2,FALSE)","v":"Team 3"},"-",{"$f":"VLOOKUP(RIGHT($C58,1),$R$5:$S$12,2,FALSE)","v":"Team 5"},"Sa/So",null,"__.__","Uhr","__"]
["6-5",35,"3-4",null,{"$f":"VLOOKUP(LEFT($C59,1),$R$5:$S$12,2,FALSE)","v":"Team 3"},"-",{"$f":"VLOOKUP(RIGHT($C59,1),$R$5:$S$12,2,FALSE)","v":"Team 4"}]
["4-2",36,"6-8",">",{"$f":"VLOOKUP(LEFT($C60,1),$R$5:$S$12,2,FALSE)","v":"Team 6"},"-",{"$f":"VLOOKUP(RIGHT($C60,1),$R$5:$S$12,2,FALSE)","v":"Team 8"},"Sa/So",null,"__.__","Uhr","__"]
["8-3",37,"6-7",null,{"$f":"VLOOKUP(LEFT($C61,1),$R$5:$S$12,2,FALSE)","v":"Team 6"},"-",{"$f":"VLOOKUP(RIGHT($C61,1),$R$5:$S$12,2,FALSE)","v":"Team 7"}]
[]
[null,{"$f":"\"9.Spieltag, \"&$O$13","v":"9.Spieltag, 05./06. Feb. 2022"}]
[null,38,"7-8",">",{"$f":"VLOOKUP(LEFT($C64,1),$R$5:$S$12,2,FALSE)","v":"Team 7"},"-",{"$f":"VLOOKUP(RIGHT($C64,1),$R$5:$S$12,2,FALSE)","v":"Team 8"},"Sa/So",null,"__.__","Uhr","__"]
["3-5",39,"1-3",">",{"$f":"VLOOKUP(LEFT($C65,1),$R$5:$S$12,2,FALSE)","v":"Team 1"},"-",{"$f":"VLOOKUP(RIGHT($C65,1),$R$5:$S$12,2,FALSE)","v":"Team 3"},"Sa/So",null,"__.__","Uhr","__"]
["1-4",40,"1-2",null,{"$f":"VLOOKUP(LEFT($C66,1),$R$5:$S$12,2,FALSE)","v":"Team 1"},"-",{"$f":"VLOOKUP(RIGHT($C66,1),$R$5:$S$12,2,FALSE)","v":"Team 2"}]
["6-8",41,"4-6",">",{"$f":"VLOOKUP(LEFT($C67,1),$R$5:$S$12,2,FALSE)","v":"Team 4"},"-",{"$f":"VLOOKUP(RIGHT($C67,1),$R$5:$S$12,2,FALSE)","v":"Team 6"},"Sa/So",null,"__.__","Uhr","__"]
["2-7",42,"4-5",null,{"$f":"VLOOKUP(LEFT($C68,1),$R$5:$S$12,2,FALSE)","v":"Team 4"},"-",{"$f":"VLOOKUP(RIGHT($C68,1),$R$5:$S$12,2,FALSE)","v":"Team 5"}]
[]
[null,{"$f":"\"10.Spieltag, \"&$O$14","v":"10.Spieltag, 19./20. Feb. 2022"}]
[null,43,"3-7",">",{"$f":"VLOOKUP(LEFT($C71,1),$R$5:$S$12,2,FALSE)","v":"Team 3"},"-",{"$f":"VLOOKUP(RIGHT($C71,1),$R$5:$S$12,2,FALSE)","v":"Team 7"},"Sa/So",null,"__.__","Uhr","__"]
["1-6",44,"1-8",">",{"$f":"VLOOKUP(LEFT($C72,1),$R$5:$S$12,2,FALSE)","v":"Team 1"},"-",{"$f":"VLOOKUP(RIGHT($C72,1),$R$5:$S$12,2,FALSE)","v":"Team 8"},"Sa/So",null,"__.__","Uhr","__"]
["4-8",45,"1-4",null,{"$f":"VLOOKUP(LEFT($C73,1),$R$5:$S$12,2,FALSE)","v":"Team 1"},"-",{"$f":"VLOOKUP(RIGHT($C73,1),$R$5:$S$12,2,FALSE)","v":"Team 4"}]
["2-3",46,"5-6",">",{"$f":"VLOOKUP(LEFT($C74,1),$R$5:$S$12,2,FALSE)","v":"Team 5"},"-",{"$f":"VLOOKUP(RIGHT($C74,1),$R$5:$S$12,2,FALSE)","v":"Team 6"},"Sa/So",null,"__.__","Uhr","__"]
["7-5",47,"5-2",null,{"$f":"VLOOKUP(LEFT($C75,1),$R$5:$S$12,2,FALSE)","v":"Team 5"},"-",{"$f":"VLOOKUP(RIGHT($C75,1),$R$5:$S$12,2,FALSE)","v":"Team 2"}]
[]
[null,{"$f":"\"11.Spieltag, \"&$O$15","v":"11.Spieltag, 12./13. Mär. 2022"}]
["8-7",48,"2-3",">",{"$f":"VLOOKUP(LEFT($C78,1),$R$5:$S$12,2,FALSE)","v":"Team 2"},"-",{"$f":"VLOOKUP(RIGHT($C78,1),$R$5:$S$12,2,FALSE)","v":"Team 3"},"Sa/So",null,"__.__","Uhr","__"]
["3-1",49,"2-8",null,{"$f":"VLOOKUP(LEFT($C79,1),$R$5:$S$12,2,FALSE)","v":"Team 2"},"-",{"$f":"VLOOKUP(RIGHT($C79,1),$R$5:$S$12,2,FALSE)","v":"Team 8"}]
["6-4",50,"7-5",">",{"$f":"VLOOKUP(LEFT($C80,1),$R$5:$S$12,2,FALSE)","v":"Team 7"},"-",{"$f":"VLOOKUP(RIGHT($C80,1),$R$5:$S$12,2,FALSE)","v":"Team 5"},"Sa/So",null,"__.__","Uhr","__"]
["5-2",51,"7-1",null,{"$f":"VLOOKUP(LEFT($C81,1),$R$5:$S$12,2,FALSE)","v":"Team 7"},"-",{"$f":"VLOOKUP(RIGHT($C81,1),$R$5:$S$12,2,FALSE)","v":"Team 1"}]
[]
[null,{"$f":"\"12.Spieltag, \"&$O$16","v":"12.Spieltag, 26./27 Mär. 2022"}]
[null,52,"8-5",">",{"$f":"VLOOKUP(LEFT($C84,1),$R$5:$S$12,2,FALSE)","v":"Team 8"},"-",{"$f":"VLOOKUP(RIGHT($C84,1),$R$5:$S$12,2,FALSE)","v":"Team 5"},"Sa/So",null,"__.__","Uhr","__"]
["8-7",53,"4-2",">",{"$f":"VLOOKUP(LEFT($C85,1),$R$5:$S$12,2,FALSE)","v":"Team 4"},"-",{"$f":"VLOOKUP(RIGHT($C85,1),$R$5:$S$12,2,FALSE)","v":"Team 2"},"Sa/So",null,"__.__","Uhr","__"]
["3-1",54,"4-7",null,{"$f":"VLOOKUP(LEFT($C86,1),$R$5:$S$12,2,FALSE)","v":"Team 4"},"-",{"$f":"VLOOKUP(RIGHT($C86,1),$R$5:$S$12,2,FALSE)","v":"Team 7"}]
["6-4",55,"6-1",">",{"$f":"VLOOKUP(LEFT($C87,1),$R$5:$S$12,2,FALSE)","v":"Team 6"},"-",{"$f":"VLOOKUP(RIGHT($C87,1),$R$5:$S$12,2,FALSE)","v":"Team 1"},"Sa/So",null,"__.__","Uhr","__"]
["5-2",56,"6-3",null,{"$f":"VLOOKUP(LEFT($C88,1),$R$5:$S$12,2,FALSE)","v":"Team 6"},"-",{"$f":"VLOOKUP(RIGHT($C88,1),$R$5:$S$12,2,FALSE)","v":"Team 3"}]
[]
["####  Mit   >   gekennzeichnete Mannschaften haben Heimrecht   ####","'####  Mit   >   gekennzeichnete Mannschaften haben Heimrecht   ####"]

{"sheet":"WVV 9 auf 12","index":3,"n_rows":103,"n_cols":18,"rows_kept":103,"cut":false,"hidden":false,"merged":[]}
[{"$f":"\"WVV-Spielplan: \"&N1","v":"WVV-Spielplan: Liga x Frauen / Männer"},null,null,null,null,null,"Saison 2021/22",null,null,null,"Seite 1(2)",null,null,"Liga x Frauen / Männer"]
[null,null,null,null,null,null,null,null,null,null,"Halle",null,"1.","23./24. Okt. 2021",1,2,"1","Team 1"]
[{"$f":"\"1.Spieltag, \"&$N$2","v":"1.Spieltag, 23./24. Okt. 2021"},null,null,null,null,null,null,null,null,null,null,null,"2.","30. Okt. 2021 (Sonntag Jugendspieltag)",5,8,"2","Team 2"]
[1,"1-5",">",{"$f":"VLOOKUP(LEFT($B4,1),$Q$2:$R$10,2,FALSE)","v":"Team 1"},"-",{"$f":"VLOOKUP(RIGHT($B4,1),$Q$2:$R$10,2,FALSE)","v":"Team 5"},"Sa/So",null,"___.___","Uhr","___",null,"3.","13./14. Nov. 2021 (Sonntag Volkstrauertag Spielverbot bis 13 Uhr)",3,6,"3","Team 3"]
[2,"1-9",null,"Team 1","-","Team 9",null,null,null,null,null,null,"4.","27./28. Nov. 2021",4,7,"4","Team 4"]
[3,"4-8",">","Team 4","-","Team 8","Sa/So",null,"___.___","Uhr","___",null,"5.","11./12. Dez. 2021",1,8,"5","Team 5"]
[4,"4-3",null,"Team 4","-","Team 3",null,null,null,null,null,null,"6.","19. Dez. 2021 (Samstag Jugendspieltag)",3,6,"6","Team 6"]
[5,"7-2",">","Team 7","-","Team 2","Sa/So",null,"___.___","Uhr","___",null,"7.","15./16. Jan. 2022",4,7,"7","Team 7"]
[6,"7-6",null,"Team 7","-","Team 6",null,null,null,null,null,null,"8.","29./30. Jan. 2022",4,7,"8","Team 8"]
[null,null,null,null,null,null,null,null,null,null,null,null,"9.","05./06. Feb. 2022",3,6,"9","Team 9"]
[{"$f":"\"2.Spieltag, \"&$N$3","v":"2.Spieltag, 30. Okt. 2021 (Sonntag Jugendspieltag)"},null,null,null,null,null,null,null,null,null,null,null,"10.","19./20. Feb. 2022",1,2]
[7,"3-1",">",{"$f":"VLOOKUP(LEFT($B12,1),$Q$2:$R$10,2,FALSE)","v":"Team 3"},"-",{"$f":"VLOOKUP(RIGHT($B12,1),$Q$2:$R$10,2,FALSE)","v":"Team 1"},"Sa",null,"___.___","Uhr","___",null,"11.","12./13. Mär. 2022",6,8]
[8,"3-8",null,"Team 3","-","Team 8",null,null,null,null,null,null,"12.","26./27 Mär. 2022",2,5]
[9,"6-4",">","Team 6","-","Team 4","Sa",null,"___.___","Uhr","___",null,null,null,"H","H"]
[10,"6-2",null,"Team 6","-","Team 2",null,null,null,null,null,null,null,"markieren"]
[11,"9-7",">","Team 9","-","Team 7","Sa",null,"___.___","Uhr","___"]
[12,"9-5",null,"Team 9","-","Team 5"]
[]
[{"$f":"\"3.Spieltag, \"&$N$4","v":"3.Spieltag, 13./14. Nov. 2021 (Sonntag Volkstrauertag Spielverbot bis 13 Uhr)"}]
[13,"2-9",">",{"$f":"VLOOKUP(LEFT($B20,1),$Q$2:$R$10,2,FALSE)","v":"Team 2"},"-",{"$f":"VLOOKUP(RIGHT($B20,1),$Q$2:$R$10,2,FALSE)","v":"Team 9"},"Sa/So",null,"___.___","Uhr","___"]
[14,"2-1",null,"Team 2","-","Team 1"]
[15,"5-3",">","Team 5","-","Team 3","Sa/So",null,"___.___","Uhr","___"]
[16,"5-4",null,"Team 5","-","Team 4"]
[17,"8-6",">","Team 8","-","Team 6","Sa/So",null,"___.___","Uhr","___"]
[18,"8-7",null,"Team 8","-","Team 7"]
[]
[{"$f":"\"4.Spieltag, \"&$N$5","v":"4.Spieltag, 27./28. Nov. 2021"}]
[19,"3-2",">",{"$f":"VLOOKUP(LEFT($B28,1),$Q$2:$R$10,2,FALSE)","v":"Team 3"},"-",{"$f":"VLOOKUP(RIGHT($B28,1),$Q$2:$R$10,2,FALSE)","v":"Team 2"},"Sa/So",null,"___.___","Uhr","___"]
[20,"3-6",null,"Team 3","-","Team 6"]
[21,"4-9",">","Team 4","-","Team 9","Sa/So",null,"___.___","Uhr","___"]
[22,"4-1",null,"Team 4","-","Team 1"]
[23,"5-7",">","Team 5","-","Team 7","Sa/So",null,"___.___","Uhr","___"]
[24,"5-8",null,"Team 5","-","Team 8"]
[]
[{"$f":"\"5.Spieltag, \"&$N$6","v":"5.Spieltag, 11./12. Dez. 2021"}]
[25,"2-4",">",{"$f":"VLOOKUP(LEFT($B36,1),$Q$2:$R$10,2,FALSE)","v":"Team 2"},"-",{"$f":"VLOOKUP(RIGHT($B36,1),$Q$2:$R$10,2,FALSE)","v":"Team 4"},"Sa/So",null,"___.___","Uhr","___"]
[26,"2-5",null,"Team 2","-","Team 5"]
[27,"1-6",">","Team 1","-","Team 6","Sa/So",null,"___.___","Uhr","___"]
[28,"1-7",null,"Team 1","-","Team 7"]
[29,"9-8",">","Team 9","-","Team 8","Sa/So",null,"___.___","Uhr","___"]
[30,"9-3",null,"Team 9","-","Team 3"]
[]
[{"$f":"\"6.Spieltag, \"&$N$7","v":"6.Spieltag, 19. Dez. 2021 (Samstag Jugendspieltag)"}]
[31,"7-3",">",{"$f":"VLOOKUP(LEFT($B44,1),$Q$2:$R$10,2,FALSE)","v":"Team 7"},"-",{"$f":"VLOOKUP(RIGHT($B44,1),$Q$2:$R$10,2,FALSE)","v":"Team 3"},null,"So","___.___","Uhr","___"]
[32,"7-4",null,"Team 7","-","Team 4"]
[33,"6-5",">","Team 6","-","Team 5",null,"So","___.___","Uhr","___"]
[34,"6-9",null,"Team 6","-","Team 9"]
[35,"8-1",">","Team 8","-","Team 1",null,"So","___.___","Uhr","___"]
[36,"8-2",null,"Team 8","-","Team 2"]
[]
["####  Mit   >   gekennzeichnete Mannschaften haben Heimrecht   ####"]
[]
[{"$f":"$A$1","v":"WVV-Spielplan: Liga x Frauen / Männer"},null,null,null,null,null,{"$f":"$G$1","v":"Saison 2021/22"},null,null,null,"Seite 2(2)"]
[null,null,null,null,null,null,null,null,null,null,"Halle"]
[{"$f":"\"7.Spieltag, \"&$N$8","v":"7.Spieltag, 15./16. Jan. 2022"}]
[37,"2-7",">",{"$f":"VLOOKUP(LEFT($B56,1),$Q$2:$R$10,2,FALSE)","v":"Team 2"},"-",{"$f":"VLOOKUP(RIGHT($B56,1),$Q$2:$R$10,2,FALSE)","v":"Team 7"},"Sa/So",null,"___.___","Uhr","___"]
[38,"2-6",null,"Team 2","-","Team 6"]
[39,"5-1",">","Team 5","-","Team 1","Sa/So",null,"___.___","Uhr","___"]
[40,"5-9",null,"Team 5","-","Team 9"]
[41,"8-4",">","Team 8","-","Team 4","Sa/So",null,"___.___","Uhr","___"]
[42,"8-3",null,"Team 8","-","Team 3"]
[]
[{"$f":"\"8.Spieltag, \"&$N$9","v":"8.Spieltag, 29./30. Jan. 2022"}]
[43,"3-5",">",{"$f":"VLOOKUP(LEFT($B64,1),$Q$2:$R$10,2,FALSE)","v":"Team 3"},"-",{"$f":"VLOOKUP(RIGHT($B64,1),$Q$2:$R$10,2,FALSE)","v":"Team 5"},"Sa/So",null,"___.___","Uhr","___"]
[44,"3-4",null,"Team 3","-","Team 4"]
[45,"6-8",">","Team 6","-","Team 8","Sa/So",null,"___.___","Uhr","___"]
[46,"6-7",null,"Team 6","-","Team 7"]
[47,"9-2",">","Team 9","-","Team 2","Sa/So",null,"___.___","Uhr","___"]
[48,"9-1",null,"Team 9","-","Team 1"]
[]
[{"$f":"\"9.Spieltag, \"&$N$10","v":"9.Spieltag, 05./06. Feb. 2022"}]
[49,"1-3",">",{"$f":"VLOOKUP(LEFT($B72,1),$Q$2:$R$10,2,FALSE)","v":"Team 1"},"-",{"$f":"VLOOKUP(RIGHT($B72,1),$Q$2:$R$10,2,FALSE)","v":"Team 3"},"Sa/So",null,"___.___","Uhr","___"]
[50,"1-2",null,"Team 1","-","Team 2"]
[51,"4-6",">","Team 4","-","Team 6","Sa/So",null,"___.___","Uhr","___"]
[52,"4-5",null,"Team 4","-","Team 5"]
[53,"7-9",">","Team 7","-","Team 9","Sa/So",null,"___.___","Uhr","___"]
[54,"7-8",null,"Team 7","-","Team 8"]
[]
[{"$f":"\"10.Spieltag, \"&$N$11","v":"10.Spieltag, 19./20. Feb. 2022"}]
[55,"1-8",">",{"$f":"VLOOKUP(LEFT($B80,1),$Q$2:$R$10,2,FALSE)","v":"Team 1"},"-",{"$f":"VLOOKUP(RIGHT($B80,1),$Q$2:$R$10,2,FALSE)","v":"Team 8"},"Sa/So",null,"___.___","Uhr","___"]
[56,"1-4",null,"Team 1","-","Team 4"]
[57,"3-7",">","Team 3","-","Team 7","Sa/So",null,"___.___","Uhr","___"]
[58,"3-9",null,"Team 3","-","Team 9"]
[59,"5-6",">","Team 5","-","Team 6","Sa/So",null,"___.___","Uhr","___"]
[60,"5-2",null,"Team 5","-","Team 2"]
[]
[{"$f":"\"11.Spieltag, \"&$N$12","v":"11.Spieltag, 12./13. Mär. 2022"}]
[61,"2-3",">",{"$f":"VLOOKUP(LEFT($B88,1),$Q$2:$R$10,2,FALSE)","v":"Team 2"},"-",{"$f":"VLOOKUP(RIGHT($B88,1),$Q$2:$R$10,2,FALSE)","v":"Team 3"},"Sa/So",null,"___.___","Uhr","___"]
[62,"2-8",null,"Team 2","-","Team 8"]
[63,"7-5",">","Team 7","-","Team 5","Sa/So",null,"___.___","Uhr","___"]
[64,"7-1",null,"Team 7","-","Team 1"]
[65,"9-4",">","Team 9","-","Team 4","Sa/So",null,"___.___","Uhr","___"]
[66,"9-6",null,"Team 9","-","Team 6"]
[]
[{"$f":"\"12.Spieltag, \"&$N$13","v":"12.Spieltag, 26./27 Mär. 2022"}]
[67,"4-2",">",{"$f":"VLOOKUP(LEFT($B96,1),$Q$2:$R$10,2,FALSE)","v":"Team 4"},"-",{"$f":"VLOOKUP(RIGHT($B96,1),$Q$2:$R$10,2,FALSE)","v":"Team 2"},"Sa/So",null,"___.___","Uhr","___"]
[68,"4-7",null,"Team 4","-","Team 7"]
[69,"6-1",">","Team 6","-","Team 1","Sa/So",null,"___.___","Uhr","___"]
[70,"6-3",null,"Team 6","-","Team 3"]
[71,"8-9",">","Team 8","-","Team 9","Sa/So",null,"___.___","Uhr","___"]
[72,"8-5",null,"Team 8","-","Team 5"]
[]
["####  Mit   >   gekennzeichnete Mannschaften haben Heimrecht   ####"]

{"sheet":"WVV 7 bzw 8 auf 14 Einzelspiele","index":4,"n_rows":91,"n_cols":16,"rows_kept":91,"cut":false,"hidden":false,"merged":[]}
[{"$f":"\"WVV-Spielplan: \"&N1","v":"WVV-Spielplan: Liga x Frauen / Männer"},null,null,null,null,null,"Saison 2021/22",null,null,null,"Seite 1(2)",null,null,"Liga x Frauen / Männer"]
[null,null,null,null,null,null,null,null,null,null,"Halle",null,"1.","23./24. Okt. 2021","1","Team 1"]
["1.Spieltag",null,null,{"$f":"$N$2","v":"23./24. Okt. 2021"},null,null,null,null,null,null,null,null,"2.","30. Okt. 2021 (Sonntag Jugendspieltag)","2","Team 2"]
[1,"1-2",">",{"$f":"VLOOKUP(LEFT($B4,SEARCH(\"-\",$B4)-1),$O$2:$P$9,2,FALSE)","v":"Team 1"},"-",{"$f":"VLOOKUP(RIGHT($B4,LEN($B4)-SEARCH(\"-\",$B4)),$O$2:$P$9,2,FALSE)","v":"Team 2"},"Sa/So",null,"__.__","Uhr","__",null,"3.","13./14. Nov. 2021 (Sonntag Volkstrauertag Spielverbot bis 13 Uhr)","3","Team 3"]
[{"$f":"A4+1","v":2},"3-4",">",{"$f":"VLOOKUP(LEFT($B5,SEARCH(\"-\",$B5)-1),$O$2:$P$9,2,FALSE)","v":"Team 3"},"-",{"$f":"VLOOKUP(RIGHT($B5,LEN($B5)-SEARCH(\"-\",$B5)),$O$2:$P$9,2,FALSE)","v":"Team 4"},"Sa/So",null,"__.__","Uhr","__",null,"4.","27./28. Nov. 2021","4","Team 4"]
[{"$f":"A5+1","v":3},"5-6",">",{"$f":"VLOOKUP(LEFT($B6,SEARCH(\"-\",$B6)-1),$O$2:$P$9,2,FALSE)","v":"Team 5"},"-",{"$f":"VLOOKUP(RIGHT($B6,LEN($B6)-SEARCH(\"-\",$B6)),$O$2:$P$9,2,FALSE)","v":"Team 6"},"Sa/So",null,"__.__","Uhr","__",null,"5.","11./12. Dez. 2021","5","Team 5"]
[{"$f":"A6+1","v":4},"7-8",">",{"$f":"VLOOKUP(LEFT($B7,SEARCH(\"-\",$B7)-1),$O$2:$P$9,2,FALSE)","v":"Team 7"},"-",{"$f":"VLOOKUP(RIGHT($B7,LEN($B7)-SEARCH(\"-\",$B7)),$O$2:$P$9,2,FALSE)","v":"Team 8"},"Sa/So",null,"__.__","Uhr","__",null,"6.","19. Dez. 2021 (Samstag Jugendspieltag)","6","Team 6"]
[null,null,null,null,null,null,null,null,null,null,null,null,"7.","15./16. Jan. 2022","7","Team 7"]
["2.Spieltag",null,null,{"$f":"$N$3","v":"30. Okt. 2021 (Sonntag Jugendspieltag)"},null,null,null,null,null,null,null,null,"8.","29./30. Jan. 2022","8","Team 8"]
[5,"2-3",">",{"$f":"VLOOKUP(LEFT($B10,SEARCH(\"-\",$B10)-1),$O$2:$P$9,2,FALSE)","v":"Team 2"},"-",{"$f":"VLOOKUP(RIGHT($B10,LEN($B10)-SEARCH(\"-\",$B10)),$O$2:$P$9,2,FALSE)","v":"Team 3"},"Sa",null,"__.__","Uhr","__",null,"9.","05./06. Feb. 2022"]
[6,"4-1",">",{"$f":"VLOOKUP(LEFT($B11,SEARCH(\"-\",$B11)-1),$O$2:$P$9,2,FALSE)","v":"Team 4"},"-",{"$f":"VLOOKUP(RIGHT($B11,LEN($B11)-SEARCH(\"-\",$B11)),$O$2:$P$9,2,FALSE)","v":"Team 1"},"Sa",null,"__.__","Uhr","__",null,"10.","12. Feb. 2022 (Sonntag Jugendspieltag)"]
[7,"6-8",">",{"$f":"VLOOKUP(LEFT($B12,SEARCH(\"-\",$B12)-1),$O$2:$P$9,2,FALSE)","v":"Team 6"},"-",{"$f":"VLOOKUP(RIGHT($B12,LEN($B12)-SEARCH(\"-\",$B12)),$O$2:$P$9,2,FALSE)","v":"Team 8"},"Sa",null,"__.__","Uhr","__",null,"11.","19./20. Feb. 2022"]
[8,"7-5",">",{"$f":"VLOOKUP(LEFT($B13,SEARCH(\"-\",$B13)-1),$O$2:$P$9,2,FALSE)","v":"Team 7"},"-",{"$f":"VLOOKUP(RIGHT($B13,LEN($B13)-SEARCH(\"-\",$B13)),$O$2:$P$9,2,FALSE)","v":"Team 5"},"Sa",null,"__.__","Uhr","__",null,"12.","12./13. Mär. 2022"]
[null,null,null,null,null,null,null,null,null,null,null,null,"13.","26./27 Mär. 2022"]
["3.Spieltag",null,null,{"$f":"$N$4","v":"13./14. Nov. 2021 (Sonntag Volkstrauertag Spielverbot bis 13 Uhr)"},null,null,null,null,null,null,null,null,"14.","09./04. Apr. 2022"]
[9,"1-6",">",{"$f":"VLOOKUP(LEFT($B16,SEARCH(\"-\",$B16)-1),$O$2:$P$9,2,FALSE)","v":"Team 1"},"-",{"$f":"VLOOKUP(RIGHT($B16,LEN($B16)-SEARCH(\"-\",$B16)),$O$2:$P$9,2,FALSE)","v":"Team 6"},"Sa/So",null,"__.__","Uhr","__"]
[10,"3-7",">",{"$f":"VLOOKUP(LEFT($B17,SEARCH(\"-\",$B17)-1),$O$2:$P$9,2,FALSE)","v":"Team 3"},"-",{"$f":"VLOOKUP(RIGHT($B17,LEN($B17)-SEARCH(\"-\",$B17)),$O$2:$P$9,2,FALSE)","v":"Team 7"},"Sa/So",null,"__.__","Uhr","__"]
[11,"5-2",">",{"$f":"VLOOKUP(LEFT($B18,SEARCH(\"-\",$B18)-1),$O$2:$P$9,2,FALSE)","v":"Team 5"},"-",{"$f":"VLOOKUP(RIGHT($B18,LEN($B18)-SEARCH(\"-\",$B18)),$O$2:$P$9,2,FALSE)","v":"Team 2"},"Sa/So",null,"__.__","Uhr","__"]
[12,"8-4",">",{"$f":"VLOOKUP(LEFT($B19,SEARCH(\"-\",$B19)-1),$O$2:$P$9,2,FALSE)","v":"Team 8"},"-",{"$f":"VLOOKUP(RIGHT($B19,LEN($B19)-SEARCH(\"-\",$B19)),$O$2:$P$9,2,FALSE)","v":"Team 4"},"Sa/So",null,"__.__","Uhr","__"]
[]
["4.Spieltag",null,null,{"$f":"$N$5","v":"27./28. Nov. 2021"}]
[13,"2-4",">",{"$f":"VLOOKUP(LEFT($B22,SEARCH(\"-\",$B22)-1),$O$2:$P$9,2,FALSE)","v":"Team 2"},"-",{"$f":"VLOOKUP(RIGHT($B22,LEN($B22)-SEARCH(\"-\",$B22)),$O$2:$P$9,2,FALSE)","v":"Team 4"},"Sa/So",null,"__.__","Uhr","__"]
[14,"6-3",">",{"$f":"VLOOKUP(LEFT($B23,SEARCH(\"-\",$B23)-1),$O$2:$P$9,2,FALSE)","v":"Team 6"},"-",{"$f":"VLOOKUP(RIGHT($B23,LEN($B23)-SEARCH(\"-\",$B23)),$O$2:$P$9,2,FALSE)","v":"Team 3"},"Sa/So",null,"__.__","Uhr","__"]
[15,"5-8",">",{"$f":"VLOOKUP(LEFT($B24,SEARCH(\"-\",$B24)-1),$O$2:$P$9,2,FALSE)","v":"Team 5"},"-",{"$f":"VLOOKUP(RIGHT($B24,LEN($B24)-SEARCH(\"-\",$B24)),$O$2:$P$9,2,FALSE)","v":"Team 8"},"Sa/So",null,"__.__","Uhr","__"]
[16,"7-1",">",{"$f":"VLOOKUP(LEFT($B25,SEARCH(\"-\",$B25)-1),$O$2:$P$9,2,FALSE)","v":"Team 7"},"-",{"$f":"VLOOKUP(RIGHT($B25,LEN($B25)-SEARCH(\"-\",$B25)),$O$2:$P$9,2,FALSE)","v":"Team 1"},"Sa/So",null,"__.__","Uhr","__"]
[]
["5.Spieltag",null,null,{"$f":"$N$6","v":"11./12. Dez. 2021"}]
[17,"1-3",">",{"$f":"VLOOKUP(LEFT($B28,SEARCH(\"-\",$B28)-1),$O$2:$P$9,2,FALSE)","v":"Team 1"},"-",{"$f":"VLOOKUP(RIGHT($B28,LEN($B28)-SEARCH(\"-\",$B28)),$O$2:$P$9,2,FALSE)","v":"Team 3"},"Sa/So",null,"__.__","Uhr","__"]
[18,"7-6",">",{"$f":"VLOOKUP(LEFT($B29,SEARCH(\"-\",$B29)-1),$O$2:$P$9,2,FALSE)","v":"Team 7"},"-",{"$f":"VLOOKUP(RIGHT($B29,LEN($B29)-SEARCH(\"-\",$B29)),$O$2:$P$9,2,FALSE)","v":"Team 6"},"Sa/So",null,"__.__","Uhr","__"]
[19,"8-2",">",{"$f":"VLOOKUP(LEFT($B30,SEARCH(\"-\",$B30)-1),$O$2:$P$9,2,FALSE)","v":"Team 8"},"-",{"$f":"VLOOKUP(RIGHT($B30,LEN($B30)-SEARCH(\"-\",$B30)),$O$2:$P$9,2,FALSE)","v":"Team 2"},"Sa/So",null,"__.__","Uhr","__"]
[20,"4-5",">",{"$f":"VLOOKUP(LEFT($B31,SEARCH(\"-\",$B31)-1),$O$2:$P$9,2,FALSE)","v":"Team 4"},"-",{"$f":"VLOOKUP(RIGHT($B31,LEN($B31)-SEARCH(\"-\",$B31)),$O$2:$P$9,2,FALSE)","v":"Team 5"},"Sa/So",null,"__.__","Uhr","__"]
[]
["6.Spieltag",null,null,{"$f":"$N$7","v":"19. Dez. 2021 (Samstag Jugendspieltag)"}]
[21,"5-1",">",{"$f":"VLOOKUP(LEFT($B34,SEARCH(\"-\",$B34)-1),$O$2:$P$9,2,FALSE)","v":"Team 5"},"-",{"$f":"VLOOKUP(RIGHT($B34,LEN($B34)-SEARCH(\"-\",$B34)),$O$2:$P$9,2,FALSE)","v":"Team 1"},null,"So","__.__","Uhr","__"]
[22,"3-8",">",{"$f":"VLOOKUP(LEFT($B35,SEARCH(\"-\",$B35)-1),$O$2:$P$9,2,FALSE)","v":"Team 3"},"-",{"$f":"VLOOKUP(RIGHT($B35,LEN($B35)-SEARCH(\"-\",$B35)),$O$2:$P$9,2,FALSE)","v":"Team 8"},null,"So","__.__","Uhr","__"]
[23,"2-6",">",{"$f":"VLOOKUP(LEFT($B36,SEARCH(\"-\",$B36)-1),$O$2:$P$9,2,FALSE)","v":"Team 2"},"-",{"$f":"VLOOKUP(RIGHT($B36,LEN($B36)-SEARCH(\"-\",$B36)),$O$2:$P$9,2,FALSE)","v":"Team 6"},null,"So","__.__","Uhr","__"]
[24,"4-7",">",{"$f":"VLOOKUP(LEFT($B37,SEARCH(\"-\",$B37)-1),$O$2:$P$9,2,FALSE)","v":"Team 4"},"-",{"$f":"VLOOKUP(RIGHT($B37,LEN($B37)-SEARCH(\"-\",$B37)),$O$2:$P$9,2,FALSE)","v":"Team 7"},null,"So","__.__","Uhr","__"]
[]
["7.Spieltag",null,null,{"$f":"$N$8","v":"15./16. Jan. 2022"}]
[25,"1-8",">",{"$f":"VLOOKUP(LEFT($B40,SEARCH(\"-\",$B40)-1),$O$2:$P$9,2,FALSE)","v":"Team 1"},"-",{"$f":"VLOOKUP(RIGHT($B40,LEN($B40)-SEARCH(\"-\",$B40)),$O$2:$P$9,2,FALSE)","v":"Team 8"},"Sa/So",null,"__.__","Uhr","__"]
[26,"3-5",">",{"$f":"VLOOKUP(LEFT($B41,SEARCH(\"-\",$B41)-1),$O$2:$P$9,2,FALSE)","v":"Team 3"},"-",{"$f":"VLOOKUP(RIGHT($B41,LEN($B41)-SEARCH(\"-\",$B41)),$O$2:$P$9,2,FALSE)","v":"Team 5"},"Sa/So",null,"__.__","Uhr","__"]
[27,"7-2",">",{"$f":"VLOOKUP(LEFT($B42,SEARCH(\"-\",$B42)-1),$O$2:$P$9,2,FALSE)","v":"Team 7"},"-",{"$f":"VLOOKUP(RIGHT($B42,LEN($B42)-SEARCH(\"-\",$B42)),$O$2:$P$9,2,FALSE)","v":"Team 2"},"Sa/So",null,"__.__","Uhr","__"]
[28,"6-4",">",{"$f":"VLOOKUP(LEFT($B43,SEARCH(\"-\",$B43)-1),$O$2:$P$9,2,FALSE)","v":"Team 6"},"-",{"$f":"VLOOKUP(RIGHT($B43,LEN($B43)-SEARCH(\"-\",$B43)),$O$2:$P$9,2,FALSE)","v":"Team 4"},"Sa/So",null,"__.__","Uhr","__"]
[]
["####   Mit   >   gekennzeichnete Mannschaften haben Heimrecht   ####"]
[]
[{"$f":"A1","v":"WVV-Spielplan: Liga x Frauen / Männer"},null,null,null,null,null,{"$f":"G1","v":"Saison 2021/22"},null,null,null,"Seite 2(2)"]
[null,null,null,null,null,null,null,null,null,null,"Halle"]
["8.Spieltag",null,null,{"$f":"$N$9","v":"29./30. Jan. 2022"}]
[29,"2-1",">",{"$f":"VLOOKUP(LEFT($B50,SEARCH(\"-\",$B50)-1),$O$2:$P$9,2,FALSE)","v":"Team 2"},"-",{"$f":"VLOOKUP(RIGHT($B50,LEN($B50)-SEARCH(\"-\",$B50)),$O$2:$P$9,2,FALSE)","v":"Team 1"},"Sa/So",null,"__.__","Uhr","__"]
[30,"4-3",">",{"$f":"VLOOKUP(LEFT($B51,SEARCH(\"-\",$B51)-1),$O$2:$P$9,2,FALSE)","v":"Team 4"},"-",{"$f":"VLOOKUP(RIGHT($B51,LEN($B51)-SEARCH(\"-\",$B51)),$O$2:$P$9,2,FALSE)","v":"Team 3"},"Sa/So",null,"__.__","Uhr","__"]
[31,"6-5",">",{"$f":"VLOOKUP(LEFT($B52,SEARCH(\"-\",$B52)-1),$O$2:$P$9,2,FALSE)","v":"Team 6"},"-",{"$f":"VLOOKUP(RIGHT($B52,LEN($B52)-SEARCH(\"-\",$B52)),$O$2:$P$9,2,FALSE)","v":"Team 5"},"Sa/So",null,"__.__","Uhr","__"]
[32,"8-7",">",{"$f":"VLOOKUP(LEFT($B53,SEARCH(\"-\",$B53)-1),$O$2:$P$9,2,FALSE)","v":"Team 8"},"-",{"$f":"VLOOKUP(RIGHT($B53,LEN($B53)-SEARCH(\"-\",$B53)),$O$2:$P$9,2,FALSE)","v":"Team 7"},"Sa/So",null,"__.__","Uhr","__"]
[]
["9.Spieltag",null,null,{"$f":"$N$10","v":"05./06. Feb. 2022"}]
[33,"3-2",">",{"$f":"VLOOKUP(LEFT($B56,SEARCH(\"-\",$B56)-1),$O$2:$P$9,2,FALSE)","v":"Team 3"},"-",{"$f":"VLOOKUP(RIGHT($B56,LEN($B56)-SEARCH(\"-\",$B56)),$O$2:$P$9,2,FALSE)","v":"Team 2"},"Sa/So",null,"__.__","Uhr","__"]
[34,"1-4",">",{"$f":"VLOOKUP(LEFT($B57,SEARCH(\"-\",$B57)-1),$O$2:$P$9,2,FALSE)","v":"Team 1"},"-",{"$f":"VLOOKUP(RIGHT($B57,LEN($B57)-SEARCH(\"-\",$B57)),$O$2:$P$9,2,FALSE)","v":"Team 4"},"Sa/So",null,"__.__","Uhr","__"]
[35,"8-6",">",{"$f":"VLOOKUP(LEFT($B58,SEARCH(\"-\",$B58)-1),$O$2:$P$9,2,FALSE)","v":"Team 8"},"-",{"$f":"VLOOKUP(RIGHT($B58,LEN($B58)-SEARCH(\"-\",$B58)),$O$2:$P$9,2,FALSE)","v":"Team 6"},"Sa/So",null,"__.__","Uhr","__"]
[36,"5-7",">",{"$f":"VLOOKUP(LEFT($B59,SEARCH(\"-\",$B59)-1),$O$2:$P$9,2,FALSE)","v":"Team 5"},"-",{"$f":"VLOOKUP(RIGHT($B59,LEN($B59)-SEARCH(\"-\",$B59)),$O$2:$P$9,2,FALSE)","v":"Team 7"},"Sa/So",null,"__.__","Uhr","__"]
[]
["10.Spieltag",null,null,{"$f":"$N$11","v":"12. Feb. 2022 (Sonntag Jugendspieltag)"}]
[37,"6-1",">",{"$f":"VLOOKUP(LEFT($B62,SEARCH(\"-\",$B62)-1),$O$2:$P$9,2,FALSE)","v":"Team 6"},"-",{"$f":"VLOOKUP(RIGHT($B62,LEN($B62)-SEARCH(\"-\",$B62)),$O$2:$P$9,2,FALSE)","v":"Team 1"},"Sa",null,"__.__","Uhr","__"]
[38,"7-3",">",{"$f":"VLOOKUP(LEFT($B63,SEARCH(\"-\",$B63)-1),$O$2:$P$9,2,FALSE)","v":"Team 7"},"-",{"$f":"VLOOKUP(RIGHT($B63,LEN($B63)-SEARCH(\"-\",$B63)),$O$2:$P$9,2,FALSE)","v":"Team 3"},"Sa",null,"__.__","Uhr","__"]
[39,"2-5",">",{"$f":"VLOOKUP(LEFT($B64,SEARCH(\"-\",$B64)-1),$O$2:$P$9,2,FALSE)","v":"Team 2"},"-",{"$f":"VLOOKUP(RIGHT($B64,LEN($B64)-SEARCH(\"-\",$B64)),$O$2:$P$9,2,FALSE)","v":"Team 5"},"Sa",null,"__.__","Uhr","__"]
[40,"4-8",">",{"$f":"VLOOKUP(LEFT($B65,SEARCH(\"-\",$B65)-1),$O$2:$P$9,2,FALSE)","v":"Team 4"},"-",{"$f":"VLOOKUP(RIGHT($B65,LEN($B65)-SEARCH(\"-\",$B65)),$O$2:$P$9,2,FALSE)","v":"Team 8"},"Sa",null,"__.__","Uhr","__"]
[]
["11.Spieltag",null,null,{"$f":"$N$12","v":"19./20. Feb. 2022"}]
[41,"4-2",">",{"$f":"VLOOKUP(LEFT($B68,SEARCH(\"-\",$B68)-1),$O$2:$P$9,2,FALSE)","v":"Team 4"},"-",{"$f":"VLOOKUP(RIGHT($B68,LEN($B68)-SEARCH(\"-\",$B68)),$O$2:$P$9,2,FALSE)","v":"Team 2"},"Sa/So",null,"__.__","Uhr","__"]
[42,"3-6",">",{"$f":"VLOOKUP(LEFT($B69,SEARCH(\"-\",$B69)-1),$O$2:$P$9,2,FALSE)","v":"Team 3"},"-",{"$f":"VLOOKUP(RIGHT($B69,LEN($B69)-SEARCH(\"-\",$B69)),$O$2:$P$9,2,FALSE)","v":"Team 6"},"Sa/So",null,"__.__","Uhr","__"]
[43,"8-5",">",{"$f":"VLOOKUP(LEFT($B70,SEARCH(\"-\",$B70)-1),$O$2:$P$9,2,FALSE)","v":"Team 8"},"-",{"$f":"VLOOKUP(RIGHT($B70,LEN($B70)-SEARCH(\"-\",$B70)),$O$2:$P$9,2,FALSE)","v":"Team 5"},"Sa/So",null,"__.__","Uhr","__"]
[44,"1-7",">",{"$f":"VLOOKUP(LEFT($B71,SEARCH(\"-\",$B71)-1),$O$2:$P$9,2,FALSE)","v":"Team 1"},"-",{"$f":"VLOOKUP(RIGHT($B71,LEN($B71)-SEARCH(\"-\",$B71)),$O$2:$P$9,2,FALSE)","v":"Team 7"},"Sa/So",null,"__.__","Uhr","__"]
[]
["12.Spieltag",null,null,{"$f":"$N$13","v":"12./13. Mär. 2022"}]
[45,"3-1",">",{"$f":"VLOOKUP(LEFT($B74,SEARCH(\"-\",$B74)-1),$O$2:$P$9,2,FALSE)","v":"Team 3"},"-",{"$f":"VLOOKUP(RIGHT($B74,LEN($B74)-SEARCH(\"-\",$B74)),$O$2:$P$9,2,FALSE)","v":"Team 1"},"Sa/So",null,"__.__","Uhr","__"]
[46,"6-7",">",{"$f":"VLOOKUP(LEFT($B75,SEARCH(\"-\",$B75)-1),$O$2:$P$9,2,FALSE)","v":"Team 6"},"-",{"$f":"VLOOKUP(RIGHT($B75,LEN($B75)-SEARCH(\"-\",$B75)),$O$2:$P$9,2,FALSE)","v":"Team 7"},"Sa/So",null,"__.__","Uhr","__"]
[47,"2-8",">",{"$f":"VLOOKUP(LEFT($B76,SEARCH(\"-\",$B76)-1),$O$2:$P$9,2,FALSE)","v":"Team 2"},"-",{"$f":"VLOOKUP(RIGHT($B76,LEN($B76)-SEARCH(\"-\",$B76)),$O$2:$P$9,2,FALSE)","v":"Team 8"},"Sa/So",null,"__.__","Uhr","__"]
[48,"5-4",">",{"$f":"VLOOKUP(LEFT($B77,SEARCH(\"-\",$B77)-1),$O$2:$P$9,2,FALSE)","v":"Team 5"},"-",{"$f":"VLOOKUP(RIGHT($B77,LEN($B77)-SEARCH(\"-\",$B77)),$O$2:$P$9,2,FALSE)","v":"Team 4"},"Sa/So",null,"__.__","Uhr","__"]
[]
["13.Spieltag",null,null,{"$f":"$N$14","v":"26./27 Mär. 2022"}]
[49,"1-5",">",{"$f":"VLOOKUP(LEFT($B80,SEARCH(\"-\",$B80)-1),$O$2:$P$9,2,FALSE)","v":"Team 1"},"-",{"$f":"VLOOKUP(RIGHT($B80,LEN($B80)-SEARCH(\"-\",$B80)),$O$2:$P$9,2,FALSE)","v":"Team 5"},"Sa/So",null,"__.__","Uhr","__"]
[50,"8-3",">",{"$f":"VLOOKUP(LEFT($B81,SEARCH(\"-\",$B81)-1),$O$2:$P$9,2,FALSE)","v":"Team 8"},"-",{"$f":"VLOOKUP(RIGHT($B81,LEN($B81)-SEARCH(\"-\",$B81)),$O$2:$P$9,2,FALSE)","v":"Team 3"},"Sa/So",null,"__.__","Uhr","__"]
[51,"6-2",">",{"$f":"VLOOKUP(LEFT($B82,SEARCH(\"-\",$B82)-1),$O$2:$P$9,2,FALSE)","v":"Team 6"},"-",{"$f":"VLOOKUP(RIGHT($B82,LEN($B82)-SEARCH(\"-\",$B82)),$O$2:$P$9,2,FALSE)","v":"Team 2"},"Sa/So",null,"__.__","Uhr","__"]
[52,"7-4",">",{"$f":"VLOOKUP(LEFT($B83,SEARCH(\"-\",$B83)-1),$O$2:$P$9,2,FALSE)","v":"Team 7"},"-",{"$f":"VLOOKUP(RIGHT($B83,LEN($B83)-SEARCH(\"-\",$B83)),$O$2:$P$9,2,FALSE)","v":"Team 4"},"Sa/So",null,"__.__","Uhr","__"]
[]
["14.Spieltag",null,null,{"$f":"$N$15","v":"09./04. Apr. 2022"}]
[53,"8-1",">",{"$f":"VLOOKUP(LEFT($B86,SEARCH(\"-\",$B86)-1),$O$2:$P$9,2,FALSE)","v":"Team 8"},"-",{"$f":"VLOOKUP(RIGHT($B86,LEN($B86)-SEARCH(\"-\",$B86)),$O$2:$P$9,2,FALSE)","v":"Team 1"},"Sa/So",null,"__.__","Uhr","__"]
[54,"5-3",">",{"$f":"VLOOKUP(LEFT($B87,SEARCH(\"-\",$B87)-1),$O$2:$P$9,2,FALSE)","v":"Team 5"},"-",{"$f":"VLOOKUP(RIGHT($B87,LEN($B87)-SEARCH(\"-\",$B87)),$O$2:$P$9,2,FALSE)","v":"Team 3"},"Sa/So",null,"__.__","Uhr","__"]
[55,"2-7",">",{"$f":"VLOOKUP(LEFT($B88,SEARCH(\"-\",$B88)-1),$O$2:$P$9,2,FALSE)","v":"Team 2"},"-",{"$f":"VLOOKUP(RIGHT($B88,LEN($B88)-SEARCH(\"-\",$B88)),$O$2:$P$9,2,FALSE)","v":"Team 7"},"Sa/So",null,"__.__","Uhr","__"]
[56,"4-6",">",{"$f":"VLOOKUP(LEFT($B89,SEARCH(\"-\",$B89)-1),$O$2:$P$9,2,FALSE)","v":"Team 4"},"-",{"$f":"VLOOKUP(RIGHT($B89,LEN($B89)-SEARCH(\"-\",$B89)),$O$2:$P$9,2,FALSE)","v":"Team 6"},"Sa/So",null,"__.__","Uhr","__"]
[]
["####   Mit   >   gekennzeichnete Mannschaften haben Heimrecht   ####"]