{"text_format":"1","workbook":"xlsx","n_sheets":8,"sheets":["WVV 6 auf 14","WVV 7 auf 14","WVV 8 auf 14","WVV 9 auf 18","WVV 10 auf 18","WVV 8 auf 14 Einzelspiele","WVV 9 auf 18 Einzelspiele","WVV 10 auf 18 Einzelspiele"],"not_rendered":{"charts":0,"images":2,"macros":0,"external_links":0,"defined_names":9,"comments":0,"pivot_tables":0},"unopened":[],"bounds":{"document_bytes":16777216,"sheet_cells":100000,"rows_first":2000,"rows_last":500,"rows_between":2000,"halvings":0,"cell_chars":16384,"cell_head_chars":4096},"cells_cut":0,"cells_raw":0,"read":"whole","date_system":"1900"}

{"sheet":"WVV 6 auf 14","index":0,"n_rows":74,"n_cols":16,"rows_kept":74,"cut":false,"hidden":false,"merged":[]}
["Spielplan \"6\"",null,null,null,null,"1/2/5/6 zwei Heimspiele","2/5 ein Einzelheimspiel"]
[null,null,null,null,null,"3/4 drei Heimspiele"]
[{"$f":"\"WVV-Spielplan: \"&N3","v":"WVV-Spielplan: Liga x Frauen / Männer"},null,null,null,null,null,"Saison 2025/26",null,null,null,"Seite 1(2)",null,null,"Liga x Frauen / Männer"]
[null,null,null,null,null,null,null,null,null,null,"Halle",null,"1.","20./21. Sept. 2025 (Sonntag WVV-Pokal)","1","Team 1"]
[{"$f":"\"1.Spieltag, \"&$N$4","v":"1.Spieltag, 20./21. Sept. 2025 (Sonntag WVV-Pokal)"},null,null,null,null,null,null,null,null,null,null,null,"2.","04./05. Okt. 2025","2","Team 2"]
[1,"2-3",">",{"$f":"VLOOKUP(LEFT($B6,1),$O$4:$P$11,2,FALSE)","v":"Team 2"},"-",{"$f":"VLOOKUP(RIGHT($B6,1),$O$4:$P$11,2,FALSE)","v":"Team 3"},"Sa/So",null,"__.__","Uhr","__",null,"3.","11./12. Okt. 2025 (Sonntag WVV-Pokalfinale)","3","Team 3"]
[{"$f":"A6+1","v":2},"5-6",null,{"$f":"VLOOKUP(LEFT($B7,1),$O$4:$P$11,2,FALSE)","v":"Team 5"},"-",{"$f":"VLOOKUP(RIGHT($B7,1),$O$4:$P$11,2,FALSE)","v":"Team 6"},null,null,null,null,null,null,"4.","25./26. Okt. 2025","4","Team 4"]
[null,null,null,null,null,null,null,null,null,null,null,null,"5.","01./02. Nov. 2025 (Samstag Allerheiligen Spielverbot bis 18.00 Uhr)","5","Team 5"]
[{"$f":"\"2.Spieltag, \"&$N$5","v":"2.Spieltag, 04./05. Okt. 2025"},null,null,null,null,null,null,null,null,null,null,null,"6.","15./16. Nov. 2025 (Sonntag Volkstrauertag Spielverbot bis 13.00 Uhr)","6","Team 6"]
[3,"1-4",">",{"$f":"VLOOKUP(LEFT($B10,1),$O$4:$P$11,2,FALSE)","v":"Team 1"},"-",{"$f":"VLOOKUP(RIGHT($B10,1),$O$4:$P$11,2,FALSE)","v":"Team 4"},"Sa/So",null,"__.__","Uhr","__",null,"7.","06./07. Dez. 2025"]
[{"$f":"A10+1","v":4},"3-5",null,{"$f":"VLOOKUP(LEFT($B11,1),$O$4:$P$11,2,FALSE)","v":"Team 3"},"-",{"$f":"VLOOKUP(RIGHT($B11,1),$O$4:$P$11,2,FALSE)","v":"Team 5"},null,null,null,null,null,null,"8.","20./21. Dez. 2025"]
[null,null,null,null,null,null,null,null,null,null,null,null,"9.","17./18. Jan. 2026"]
[{"$f":"\"3.Spieltag, \"&$N$6","v":"3.Spieltag, 11./12. Okt. 2025 (Sonntag WVV-Pokalfinale)"},null,null,null,null,null,null,null,null,null,null,null,"10.","24. Jan. 2026 (Sonntag Jugendspieltag)"]
[5,"3-6",">",{"$f":"VLOOKUP(LEFT($B14,1),$O$4:$P$11,2,FALSE)","v":"Team 3"},"-",{"$f":"VLOOKUP(RIGHT($B14,1),$O$4:$P$11,2,FALSE)","v":"Team 6"},"Sa/So",null,"__.__","Uhr","__",null,"11.","31. Jan./01. Feb. 2026 (Sonntag 1. Runde Bezirkspokal bis OL)"]
[{"$f":"A14+1","v":6},"4-2",null,{"$f":"VLOOKUP(LEFT($B15,1),$O$4:$P$11,2,FALSE)","v":"Team 4"},"-",{"$f":"VLOOKUP(RIGHT($B15,1),$O$4:$P$11,2,FALSE)","v":"Team 2"},null,null,null,null,null,null,"12.","21./22. Feb. 2026 (Sonntag 2. Runde Bezirkspokal)"]
[null,null,null,null,null,null,null,null,null,null,null,null,"13.","07./08. Mär. 2026"]
[{"$f":"\"4.Spieltag, \"&$N$7","v":"4.Spieltag, 25./26. Okt. 2025"},null,null,null,null,null,null,null,null,null,null,null,"14.","21./22. Mär. 2026"]
[7,"4-5",">",{"$f":"VLOOKUP(LEFT($B18,1),$O$4:$P$11,2,FALSE)","v":"Team 4"},"-",{"$f":"VLOOKUP(RIGHT($B18,1),$O$4:$P$11,2,FALSE)","v":"Team 5"},"Sa/So",null,"__.__","Uhr","__"]
[{"$f":"A18+1","v":8},"2-1",null,{"$f":"VLOOKUP(LEFT($B19,1),$O$4:$P$11,2,FALSE)","v":"Team 2"},"-",{"$f":"VLOOKUP(RIGHT($B19,1),$O$4:$P$11,2,FALSE)","v":"Team 1"}]
[]
[{"$f":"\"5.Spieltag, \"&$N$8","v":"5.Spieltag, 01./02. Nov. 2025 (Samstag Allerheiligen Spielverbot bis 18.00 Uhr)"}]
[9,"5-1",">",{"$f":"VLOOKUP(LEFT($B22,1),$O$4:$P$11,2,FALSE)","v":"Team 5"},"-",{"$f":"VLOOKUP(RIGHT($B22,1),$O$4:$P$11,2,FALSE)","v":"Team 1"},"So",null,"__.__","Uhr","__"]
[{"$f":"A22+1","v":10},"6-4",null,{"$f":"VLOOKUP(LEFT($B23,1),$O$4:$P$11,2,FALSE)","v":"Team 6"},"-",{"$f":"VLOOKUP(RIGHT($B23,1),$O$4:$P$11,2,FALSE)","v":"Team 4"}]
[]
[{"$f":"\"6.Spieltag, \"&$N$9","v":"6.Spieltag, 15./16. Nov. 2025 (Sonntag Volkstrauertag Spielverbot bis 13.00 Uhr)"}]
[11,"6-2",">",{"$f":"VLOOKUP(LEFT($B26,1),$O$4:$P$11,2,FALSE)","v":"Team 6"},"-",{"$f":"VLOOKUP(RIGHT($B26,1),$O$4:$P$11,2,FALSE)","v":"Team 2"},"Sa/So",null,"__.__","Uhr","__"]
[{"$f":"A26+1","v":12},"3-1",null,{"$f":"VLOOKUP(LEFT($B27,1),$O$4:$P$11,2,FALSE)","v":"Team 3"},"-",{"$f":"VLOOKUP(RIGHT($B27,1),$O$4:$P$11,2,FALSE)","v":"Team 1"}]
[]
[{"$f":"\"7.Spieltag, \"&$N$10","v":"7.Spieltag, 06./07. Dez. 2025"}]
[13,"5-2",">",{"$f":"VLOOKUP(LEFT($B30,1),$O$4:$P$11,2,FALSE)","v":"Team 5"},"-",{"$f":"VLOOKUP(RIGHT($B30,1),$O$4:$P$11,2,FALSE)","v":"Team 2"},"Sa/So",null,"__.__","Uhr","__"]
[{"$f":"A30+1","v":14},"4-3",">",{"$f":"VLOOKUP(LEFT($B31,1),$O$4:$P$11,2,FALSE)","v":"Team 4"},"-",{"$f":"VLOOKUP(RIGHT($B31,1),$O$4:$P$11,2,FALSE)","v":"Team 3"},"Sa/So",null,"__.__","Uhr","__"]
[{"$f":"A31+1","v":15},"1-6",null,{"$f":"VLOOKUP(LEFT($B32,1),$O$4:$P$11,2,FALSE)","v":"Team 1"},"-",{"$f":"VLOOKUP(RIGHT($B32,1),$O$4:$P$11,2,FALSE)","v":"Team 6"}]
[]
["####   Mit   >   gekennzeichnete Mannschaften haben Heimrecht   ####"]
[]
[{"$f":"A3","v":"WVV-Spielplan: Liga x Frauen / Männer"},null,null,null,null,null,{"$f":"G3","v":"Saison 2025/26"},null,null,null,"Seite 2(2)"]
[null,null,null,null,null,null,null,null,null,null,"Halle"]
[{"$f":"\"8.Spieltag, \"&$N$11","v":"8.Spieltag, 20./21. Dez. 2025"}]
[16,"3-2",">",{"$f":"VLOOKUP(LEFT($B39,1),$O$4:$P$11,2,FALSE)","v":"Team 3"},"-",{"$f":"VLOOKUP(RIGHT($B39,1),$O$4:$P$11,2,FALSE)","v":"Team 2"},"Sa/So",null,"__.__","Uhr","__"]
[{"$f":"A39+1","v":17},"6-5",null,{"$f":"VLOOKUP(LEFT($B40,1),$O$4:$P$11,2,FALSE)","v":"Team 6"},"-",{"$f":"VLOOKUP(RIGHT($B40,1),$O$4:$P$11,2,FALSE)","v":"Team 5"}]
[]
[{"$f":"\"9.Spieltag, \"&$N$12","v":"9.Spieltag, 17./18. Jan. 2026"}]
[18,"4-1",">",{"$f":"VLOOKUP(LEFT($B43,1),$O$4:$P$11,2,FALSE)","v":"Team 4"},"-",{"$f":"VLOOKUP(RIGHT($B43,1),$O$4:$P$11,2,FALSE)","v":"Team 1"},"Sa/So",null,"__.__","Uhr","__"]
[{"$f":"A43+1","v":19},"5-3",null,{"$f":"VLOOKUP(LEFT($B44,1),$O$4:$P$11,2,FALSE)","v":"Team 5"},"-",{"$f":"VLOOKUP(RIGHT($B44,1),$O$4:$P$11,2,FALSE)","v":"Team 3"}]
[]
[{"$f":"\"10.Spieltag, \"&$N$13","v":"10.Spieltag, 24. Jan. 2026 (Sonntag Jugendspieltag)"}]
[20,"6-3",">",{"$f":"VLOOKUP(LEFT($B47,1),$O$4:$P$11,2,FALSE)","v":"Team 6"},"-",{"$f":"VLOOKUP(RIGHT($B47,1),$O$4:$P$11,2,FALSE)","v":"Team 3"},"Sa",null,"__.__","Uhr","__"]
[{"$f":"A47+1","v":21},"2-4",null,{"$f":"VLOOKUP(LEFT($B48,1),$O$4:$P$11,2,FALSE)","v":"Team 2"},"-",{"$f":"VLOOKUP(RIGHT($B48,1),$O$4:$P$11,2,FALSE)","v":"Team 4"}]
[]
[{"$f":"\"11.Spieltag, \"&$N$14","v":"11.Spieltag, 31. Jan./01. Feb. 2026 (Sonntag 1. Runde Bezirkspokal bis OL)"}]
[22,"5-4",">",{"$f":"VLOOKUP(LEFT($B51,1),$O$4:$P$11,2,FALSE)","v":"Team 5"},"-",{"$f":"VLOOKUP(RIGHT($B51,1),$O$4:$P$11,2,FALSE)","v":"Team 4"},"Sa/So",null,"__.__","Uhr","__"]
[{"$f":"A51+1","v":23},"1-2",null,{"$f":"VLOOKUP(LEFT($B52,1),$O$4:$P$11,2,FALSE)","v":"Team 1"},"-",{"$f":"VLOOKUP(RIGHT($B52,1),$O$4:$P$11,2,FALSE)","v":"Team 2"}]
[]
[{"$f":"\"12.Spieltag, \"&$N$15","v":"12.Spieltag, 21./22. Feb. 2026 (Sonntag 2. Runde Bezirkspokal)"}]
[24,"1-5",">",{"$f":"VLOOKUP(LEFT($B55,1),$O$4:$P$11,2,FALSE)","v":"Team 1"},"-",{"$f":"VLOOKUP(RIGHT($B55,1),$O$4:$P$11,2,FALSE)","v":"Team 5"},"Sa/So",null,"__.__","Uhr","__"]
[{"$f":"A55+1","v":25},"4-6",null,{"$f":"VLOOKUP(LEFT($B56,1),$O$4:$P$11,2,FALSE)","v":"Team 4"},"-",{"$f":"VLOOKUP(RIGHT($B56,1),$O$4:$P$11,2,FALSE)","v":"Team 6"}]
[]
[{"$f":"\"13.Spieltag, \"&$N$16","v":"13.Spieltag, 07./08. Mär. 2026"}]
[26,"2-6",">",{"$f":"VLOOKUP(LEFT($B59,1),$O$4:$P$11,2,FALSE)","v":"Team 2"},"-",{"$f":"VLOOKUP(RIGHT($B59,1),$O$4:$P$11,2,FALSE)","v":"Team 6"},"Sa/So",null,"__.__","Uhr","__"]
[{"$f":"A59+1","v":27},"1-3",null,{"$f":"VLOOKUP(LEFT($B60,1),$O$4:$P$11,2,FALSE)","v":"Team 1"},"-",{"$f":"VLOOKUP(RIGHT($B60,1),$O$4:$P$11,2,FALSE)","v":"Team 3"}]
[]
[{"$f":"\"14.Spieltag, \"&$N$17","v":"14.Spieltag, 21./22. Mär. 2026"}]
[28,"2-5",">",{"$f":"VLOOKUP(LEFT($B63,1),$O$4:$P$11,2,FALSE)","v":"Team 2"},"-",{"$f":"VLOOKUP(RIGHT($B63,1),$O$4:$P$11,2,FALSE)","v":"Team 5"},"Sa/So",null,"__.__","Uhr","__"]
[{"$f":"A63+1","v":29},"3-4",">",{"$f":"VLOOKUP(LEFT($B64,1),$O$4:$P$11,2,FALSE)","v":"Team 3"},"-",{"$f":"VLOOKUP(RIGHT($B64,1),$O$4:$P$11,2,FALSE)","v":"Team 4"},"Sa/So",null,"__.__","Uhr","__"]
[{"$f":"A64+1","v":30},"6-1",null,{"$f":"VLOOKUP(LEFT($B65,1),$O$4:$P$11,2,FALSE)","v":"Team 6"},"-",{"$f":"VLOOKUP(RIGHT($B65,1),$O$4:$P$11,2,FALSE)","v":"Team 1"}]
[]
["Relegation: 01. – 03. Mai 2026"]
[]
["####   Mit   >   gekennzeichnete Mannschaften haben Heimrecht   ####"]
[]
[]
[]
[]
[null,null,null,null,null,null,null,null,null,null," "]

{"sheet":"WVV 7 auf 14","index":1,"n_rows":86,"n_cols":16,"rows_kept":86,"cut":false,"hidden":false,"merged":[]}
["Spielplan \"7\"",null,null,null,null,"alle 2 Heimspiele",null,"2&4=> ein Verein"]
[null,null,null,null,null,"alle 2 Einzelspiele"]
[{"$f":"\"WVV-Spielplan: \"&N3","v":"WVV-Spielplan: Liga x Frauen / Männer"},null,null,null,null,null,"Saison 2025/26",null,null,null,"Seite 1(2)",null,null,"Liga x Frauen / Männer"]
[null,null,null,null,null,null,null,null,null,null,"Halle",null,"1.","20./21. Sept. 2025 (Sonntag WVV-Pokal)","1","Team 1"]
[{"$f":"\"1.Spieltag, \"&$N$4","v":"1.Spieltag, 20./21. Sept. 2025 (Sonntag WVV-Pokal)"},null,null,null,null,null,null,null,null,null,null,null,"2.","04./05. Okt. 2025","2","Team 2"]
[1,"1-7",">",{"$f":"VLOOKUP(LEFT($B6,1),$O$4:$P$11,2,FALSE)","v":"Team 1"},"-",{"$f":"VLOOKUP(RIGHT($B6,1),$O$4:$P$11,2,FALSE)","v":"Team 7"},"Sa/So",null,"__.__","Uhr","__",null,"3.","11./12. Okt. 2025 (Sonntag WVV-Pokalfinale)","3","Team 3"]
[{"$f":"A6+1","v":2},"2-4",">",{"$f":"VLOOKUP(LEFT($B7,1),$O$4:$P$11,2,FALSE)","v":"Team 2"},"-",{"$f":"VLOOKUP(RIGHT($B7,1),$O$4:$P$11,2,FALSE)","v":"Team 4"},"Sa/So",null,"__.__","Uhr","__",null,"4.","25./26. Okt. 2025","4","Team 4"]
[{"$f":"A7+1","v":3},"5-6",null,{"$f":"VLOOKUP(LEFT($B8,1),$O$4:$P$11,2,FALSE)","v":"Team 5"},"-",{"$f":"VLOOKUP(RIGHT($B8,1),$O$4:$P$11,2,FALSE)","v":"Team 6"},null,null,null,null,null,null,"5.","01./02. Nov. 2025 (Samstag Allerheiligen Spielverbot bis 18.00 Uhr)","5","Team 5"]
[null,null,null,null,null,null,null,null,null,null,null,null,"6.","15./16. Nov. 2025 (Sonntag Volkstrauertag Spielverbot bis 13.00 Uhr)","6","Team 6"]
[{"$f":"\"2.Spieltag, \"&$N$5","v":"2.Spieltag, 04./05. Okt. 2025"},null,null,null,null,null,null,null,null,null,null,null,"7.","06./07. Dez. 2025","7","Team 7"]
[4,"7-2",">",{"$f":"VLOOKUP(LEFT($B11,1),$O$4:$P$11,2,FALSE)","v":"Team 7"},"-",{"$f":"VLOOKUP(RIGHT($B11,1),$O$4:$P$11,2,FALSE)","v":"Team 2"},"Sa/So",null,"__.__","Uhr","__",null,"8.","20./21. Dez. 2025"]
[{"$f":"A11+1","v":5},"5-3",">",{"$f":"VLOOKUP(LEFT($B12,1),$O$4:$P$11,2,FALSE)","v":"Team 5"},"-",{"$f":"VLOOKUP(RIGHT($B12,1),$O$4:$P$11,2,FALSE)","v":"Team 3"},"Sa/So",null,"__.__","Uhr","__",null,"9.","17./18. Jan. 2026"]
[{"$f":"A12+1","v":6},"4-1",null,{"$f":"VLOOKUP(LEFT($B13,1),$O$4:$P$11,2,FALSE)","v":"Team 4"},"-",{"$f":"VLOOKUP(RIGHT($B13,1),$O$4:$P$11,2,FALSE)","v":"Team 1"},null,null,null,null,null,null,"10.","24. Jan. 2026 (Sonntag Jugendspieltag)"]
[null,null,null,null,null,null,null,null,null,null,null,null,"11.","31. Jan./01. Feb. 2026 (Sonntag 1. Runde Bezirkspokal bis OL)"]
[{"$f":"\"3.Spieltag, \"&$N$6","v":"3.Spieltag, 11./12. Okt. 2025 (Sonntag WVV-Pokalfinale)"},null,null,null,null,null,null,null,null,null,null,null,"12.","21./22. Feb. 2026 (Sonntag 2. Runde Bezirkspokal)"]
[7,"6-1",">",{"$f":"VLOOKUP(LEFT($B16,1),$O$4:$P$11,2,FALSE)","v":"Team 6"},"-",{"$f":"VLOOKUP(RIGHT($B16,1),$O$4:$P$11,2,FALSE)","v":"Team 1"},"Sa/So",null,"__.__","Uhr","__",null,"13.","07./08. Mär. 2026"]
[{"$f":"A16+1","v":8},"3-2",">",{"$f":"VLOOKUP(LEFT($B17,1),$O$4:$P$11,2,FALSE)","v":"Team 3"},"-",{"$f":"VLOOKUP(RIGHT($B17,1),$O$4:$P$11,2,FALSE)","v":"Team 2"},"Sa/So",null,"__.__","Uhr","__",null,"14.","21./22. Mär. 2026"]
[{"$f":"A17+1","v":9},"5-7",null,{"$f":"VLOOKUP(LEFT($B18,1),$O$4:$P$11,2,FALSE)","v":"Team 5"},"-",{"$f":"VLOOKUP(RIGHT($B18,1),$O$4:$P$11,2,FALSE)","v":"Team 7"}]
[]
[{"$f":"\"4.Spieltag, \"&$N$7","v":"4.Spieltag, 25./26. Okt. 2025"}]
[10,"2-5",">",{"$f":"VLOOKUP(LEFT($B21,1),$O$4:$P$11,2,FALSE)","v":"Team 2"},"-",{"$f":"VLOOKUP(RIGHT($B21,1),$O$4:$P$11,2,FALSE)","v":"Team 5"},"Sa/So",null,"__.__","Uhr","__"]
[{"$f":"A21+1","v":11},"4-6",">",{"$f":"VLOOKUP(LEFT($B22,1),$O$4:$P$11,2,FALSE)","v":"Team 4"},"-",{"$f":"VLOOKUP(RIGHT($B22,1),$O$4:$P$11,2,FALSE)","v":"Team 6"},"Sa/So",null,"__.__","Uhr","__"]
[{"$f":"A22+1","v":12},"1-3",null,{"$f":"VLOOKUP(LEFT($B23,1),$O$4:$P$11,2,FALSE)","v":"Team 1"},"-",{"$f":"VLOOKUP(RIGHT($B23,1),$O$4:$P$11,2,FALSE)","v":"Team 3"}]
[]
[{"$f":"\"5.Spieltag, \"&$N$8","v":"5.Spieltag, 01./02. Nov. 2025 (Samstag Allerheiligen Spielverbot bis 18.00 Uhr)"}]
[13,"3-6",">",{"$f":"VLOOKUP(LEFT($B26,1),$O$4:$P$11,2,FALSE)","v":"Team 3"},"-",{"$f":"VLOOKUP(RIGHT($B26,1),$O$4:$P$11,2,FALSE)","v":"Team 6"},"So",null,"__.__","Uhr","__"]
[{"$f":"A26+1","v":14},"1-5",">",{"$f":"VLOOKUP(LEFT($B27,1),$O$4:$P$11,2,FALSE)","v":"Team 1"},"-",{"$f":"VLOOKUP(RIGHT($B27,1),$O$4:$P$11,2,FALSE)","v":"Team 5"},"So",null,"__.__","Uhr","__"]
[{"$f":"A27+1","v":15},"4-7",null,{"$f":"VLOOKUP(LEFT($B28,1),$O$4:$P$11,2,FALSE)","v":"Team 4"},"-",{"$f":"VLOOKUP(RIGHT($B28,1),$O$4:$P$11,2,FALSE)","v":"Team 7"}]
[]
[{"$f":"\"6.Spieltag, \"&$N$9","v":"6.Spieltag, 15./16. Nov. 2025 (Sonntag Volkstrauertag Spielverbot bis 13.00 Uhr)"}]
[16,"4-3",">",{"$f":"VLOOKUP(LEFT($B31,1),$O$4:$P$11,2,FALSE)","v":"Team 4"},"-",{"$f":"VLOOKUP(RIGHT($B31,1),$O$4:$P$11,2,FALSE)","v":"Team 3"},"Sa/So",null,"__.__","Uhr","__"]
[{"$f":"A31+1","v":17},"6-7",">",{"$f":"VLOOKUP(LEFT($B32,1),$O$4:$P$11,2,FALSE)","v":"Team 6"},"-",{"$f":"VLOOKUP(RIGHT($B32,1),$O$4:$P$11,2,FALSE)","v":"Team 7"},"Sa/So",null,"__.__","Uhr","__"]
[{"$f":"A32+1","v":18},"2-1",null,{"$f":"VLOOKUP(LEFT($B33,1),$O$4:$P$11,2,FALSE)","v":"Team 2"},"-",{"$f":"VLOOKUP(RIGHT($B33,1),$O$4:$P$11,2,FALSE)","v":"Team 1"}]
[]
[{"$f":"\"7.Spieltag, \"&$N$10","v":"7.Spieltag, 06./07. Dez. 2025"}]
[19,"5-4",">",{"$f":"VLOOKUP(LEFT($B36,1),$O$4:$P$11,2,FALSE)","v":"Team 5"},"-",{"$f":"VLOOKUP(RIGHT($B36,1),$O$4:$P$11,2,FALSE)","v":"Team 4"},"Sa/So",null,"__.__","Uhr","__"]
[{"$f":"A36+1","v":20},"7-3",">",{"$f":"VLOOKUP(LEFT($B37,1),$O$4:$P$11,2,FALSE)","v":"Team 7"},"-",{"$f":"VLOOKUP(RIGHT($B37,1),$O$4:$P$11,2,FALSE)","v":"Team 3"},"Sa/So",null,"__.__","Uhr","__"]
[{"$f":"A37+1","v":21},"6-2",null,{"$f":"VLOOKUP(LEFT($B38,1),$O$4:$P$11,2,FALSE)","v":"Team 6"},"-",{"$f":"VLOOKUP(RIGHT($B38,1),$O$4:$P$11,2,FALSE)","v":"Team 2"}]
[]
["####   Mit   >   gekennzeichnete Mannschaften haben Heimrecht   ####"]
[]
[{"$f":"A3","v":"WVV-Spielplan: Liga x Frauen / Männer"},null,null,null,null,null,{"$f":"G3","v":"Saison 2025/26"},null,null,null,"Seite 2(2)"]
[null,null,null,null,null,null,null,null,null,null,"Halle"]
[{"$f":"\"8.Spieltag, \"&$N$11","v":"8.Spieltag, 20./21. Dez. 2025"}]
[22,"7-1",">",{"$f":"VLOOKUP(LEFT($B45,1),$O$4:$P$11,2,FALSE)","v":"Team 7"},"-",{"$f":"VLOOKUP(RIGHT($B45,1),$O$4:$P$11,2,FALSE)","v":"Team 1"},"Sa/So",null,"__.__","Uhr","__"]
[{"$f":"A45+1","v":23},"4-2",">",{"$f":"VLOOKUP(LEFT($B46,1),$O$4:$P$11,2,FALSE)","v":"Team 4"},"-",{"$f":"VLOOKUP(RIGHT($B46,1),$O$4:$P$11,2,FALSE)","v":"Team 2"},"Sa/So",null,"__.__","Uhr","__"]
[{"$f":"A46+1","v":24},"6-5",null,{"$f":"VLOOKUP(LEFT($B47,1),$O$4:$P$11,2,FALSE)","v":"Team 6"},"-",{"$f":"VLOOKUP(RIGHT($B47,1),$O$4:$P$11,2,FALSE)","v":"Team 5"}]
[]
[{"$f":"\"9.Spieltag, \"&$N$12","v":"9.Spieltag, 17./18. Jan. 2026"}]
[25,"2-7",">",{"$f":"VLOOKUP(LEFT($B50,1),$O$4:$P$11,2,FALSE)","v":"Team 2"},"-",{"$f":"VLOOKUP(RIGHT($B50,1),$O$4:$P$11,2,FALSE)","v":"Team 7"},"Sa/So",null,"__.__","Uhr","__"]
[{"$f":"A50+1","v":26},"1-4",">",{"$f":"VLOOKUP(LEFT($B51,1),$O$4:$P$11,2,FALSE)","v":"Team 1"},"-",{"$f":"VLOOKUP(RIGHT($B51,1),$O$4:$P$11,2,FALSE)","v":"Team 4"},"Sa/So",null,"__.__","Uhr","__"]
[{"$f":"A51+1","v":27},"3-5",null,{"$f":"VLOOKUP(LEFT($B52,1),$O$4:$P$11,2,FALSE)","v":"Team 3"},"-",{"$f":"VLOOKUP(RIGHT($B52,1),$O$4:$P$11,2,FALSE)","v":"Team 5"}]
[]
[{"$f":"\"10.Spieltag, \"&$N$13","v":"10.Spieltag, 24. Jan. 2026 (Sonntag Jugendspieltag)"}]
[28,"1-6",">",{"$f":"VLOOKUP(LEFT($B55,1),$O$4:$P$11,2,FALSE)","v":"Team 1"},"-",{"$f":"VLOOKUP(RIGHT($B55,1),$O$4:$P$11,2,FALSE)","v":"Team 6"},"Sa",null,"__.__","Uhr","__"]
[{"$f":"A55+1","v":29},"2-3",">",{"$f":"VLOOKUP(LEFT($B56,1),$O$4:$P$11,2,FALSE)","v":"Team 2"},"-",{"$f":"VLOOKUP(RIGHT($B56,1),$O$4:$P$11,2,FALSE)","v":"Team 3"},"Sa",null,"__.__","Uhr","__"]
[{"$f":"A56+1","v":30},"7-5",null,{"$f":"VLOOKUP(LEFT($B57,1),$O$4:$P$11,2,FALSE)","v":"Team 7"},"-",{"$f":"VLOOKUP(RIGHT($B57,1),$O$4:$P$11,2,FALSE)","v":"Team 5"}]
[]
[{"$f":"\"11.Spieltag, \"&$N$14","v":"11.Spieltag, 31. Jan./01. Feb. 2026 (Sonntag 1. Runde Bezirkspokal bis OL)"}]
[31,"5-2",">",{"$f":"VLOOKUP(LEFT($B60,1),$O$4:$P$11,2,FALSE)","v":"Team 5"},"-",{"$f":"VLOOKUP(RIGHT($B60,1),$O$4:$P$11,2,FALSE)","v":"Team 2"},"Sa/So",null,"__.__","Uhr","__"]
[{"$f":"A60+1","v":32},"6-4",">",{"$f":"VLOOKUP(LEFT($B61,1),$O$4:$P$11,2,FALSE)","v":"Team 6"},"-",{"$f":"VLOOKUP(RIGHT($B61,1),$O$4:$P$11,2,FALSE)","v":"Team 4"},"Sa/So",null,"__.__","Uhr","__"]
[{"$f":"A61+1","v":33},"3-1",null,{"$f":"VLOOKUP(LEFT($B62,1),$O$4:$P$11,2,FALSE)","v":"Team 3"},"-",{"$f":"VLOOKUP(RIGHT($B62,1),$O$4:$P$11,2,FALSE)","v":"Team 1"}]
[]
[{"$f":"\"12.Spieltag, \"&$N$15","v":"12.Spieltag, 21./22. Feb. 2026 (Sonntag 2. Runde Bezirkspokal)"}]
[34,"6-3",">",{"$f":"VLOOKUP(LEFT($B65,1),$O$4:$P$11,2,FALSE)","v":"Team 6"},"-",{"$f":"VLOOKUP(RIGHT($B65,1),$O$4:$P$11,2,FALSE)","v":"Team 3"},"Sa/So",null,"__.__","Uhr","__"]
[{"$f":"A65+1","v":35},"5-1",">",{"$f":"VLOOKUP(LEFT($B66,1),$O$4:$P$11,2,FALSE)","v":"Team 5"},"-",{"$f":"VLOOKUP(RIGHT($B66,1),$O$4:$P$11,2,FALSE)","v":"Team 1"},"Sa/So",null,"__.__","Uhr","__"]
[{"$f":"A66+1","v":36},"7-4",null,{"$f":"VLOOKUP(LEFT($B67,1),$O$4:$P$11,2,FALSE)","v":"Team 7"},"-",{"$f":"VLOOKUP(RIGHT($B67,1),$O$4:$P$11,2,FALSE)","v":"Team 4"}]
[]
[{"$f":"\"13.Spieltag, \"&$N$16","v":"13.Spieltag, 07./08. Mär. 2026"}]
[37,"3-4",">",{"$f":"VLOOKUP(LEFT($B70,1),$O$4:$P$11,2,FALSE)","v":"Team 3"},"-",{"$f":"VLOOKUP(RIGHT($B70,1),$O$4:$P$11,2,FALSE)","v":"Team 4"},"Sa/So",null,"__.__","Uhr","__"]
[{"$f":"A70+1","v":38},"7-6",">",{"$f":"VLOOKUP(LEFT($B71,1),$O$4:$P$11,2,FALSE)","v":"Team 7"},"-",{"$f":"VLOOKUP(RIGHT($B71,1),$O$4:$P$11,2,FALSE)","v":"Team 6"},"Sa/So",null,"__.__","Uhr","__"]
[{"$f":"A71+1","v":39},"1-2",null,{"$f":"VLOOKUP(LEFT($B72,1),$O$4:$P$11,2,FALSE)","v":"Team 1"},"-",{"$f":"VLOOKUP(RIGHT($B72,1),$O$4:$P$11,2,FALSE)","v":"Team 2"}]
[]
[{"$f":"\"14.Spieltag, \"&$N$17","v":"14.Spieltag, 21./22. Mär. 2026"}]
[40,"4-5",">",{"$f":"VLOOKUP(LEFT($B75,1),$O$4:$P$11,2,FALSE)","v":"Team 4"},"-",{"$f":"VLOOKUP(RIGHT($B75,1),$O$4:$P$11,2,FALSE)","v":"Team 5"},"Sa/So",null,"__.__","Uhr","__"]
[{"$f":"A75+1","v":41},"3-7",">",{"$f":"VLOOKUP(LEFT($B76,1),$O$4:$P$11,2,FALSE)","v":"Team 3"},"-",{"$f":"VLOOKUP(RIGHT($B76,1),$O$4:$P$11,2,FALSE)","v":"Team 7"},"Sa/So",null,"__.__","Uhr","__"]
[{"$f":"A76+1","v":42},"2-6",null,{"$f":"VLOOKUP(LEFT($B77,1),$O$4:$P$11,2,FALSE)","v":"Team 2"},"-",{"$f":"VLOOKUP(RIGHT($B77,1),$O$4:$P$11,2,FALSE)","v":"Team 6"}]
[]
["Relegation: 01. – 03. Mai 2026"]
[]
["####   Mit   >   gekennzeichnete Mannschaften haben Heimrecht   ####"]
[]
[]
[]
[]
[null,null,null,null,null,null,null,null,null,null," "]

{"sheet":"WVV 8 auf 14","index":2,"n_rows":101,"n_cols":27,"rows_kept":101,"cut":false,"hidden":false,"merged":[]}
[null,"Spielplan \"8\"",null,null,null,null,"1/2/5/8=> 3HSp",null,"1&7=> ein Verein"]
[null,null,null,null,null,null,"3/4/6/7=> 4HSp",null,"2&4=> ein Verein"]
["2&4=> 13.SpT !!!",null,null,null,null,null,"2&4=> 5./12.SpT !!!","1&7=> 13.SpT !!!"]
[null,{"$f":"\"WVV-Spielplan: \"&O4","v":"WVV-Spielplan: Liga x Frauen / Männer"},null,null,null,null,null,"Saison 2025/26",null,null,null,"Seite 1(2)",null,null,"Liga x Frauen / Männer"]
[null,null,null,null,null,null,null,null,null,null,null,"Halle",null,"1.","20./21. Sept. 2025 (Sonntag WVV-Pokal)","1","Team 1",1,3,"-",1,2,3,3,2,"-",{"$f":"SUM(S5:Z5)","v":14}]
[null,{"$f":"\"1.Spieltag, \"&$O$5","v":"1.Spieltag, 20./21. Sept. 2025 (Sonntag WVV-Pokal)"},null,null,null,null,null,null,null,null,null,null,null,"2.","04./05. Okt. 2025","2","Team 2",2,"-",3,2,1,"-",2,3,3,14]
["1-7",1,"1-7",">",{"$f":"VLOOKUP(LEFT($C7,1),$P$5:$Q$12,2,FALSE)","v":"Team 1"},"-",{"$f":"VLOOKUP(RIGHT($C7,1),$P$5:$Q$12,2,FALSE)","v":"Team 7"},"Sa/So",null,"__.__","Uhr","__",null,"3.","11./12. Okt. 2025 (Sonntag WVV-Pokalfinale)","3","Team 3",3,1,2,4,3,2,1,1,"-",14]
["5-6",2,"5-6",null,{"$f":"VLOOKUP(LEFT($C8,1),$P$5:$Q$12,2,FALSE)","v":"Team 5"},"-",{"$f":"VLOOKUP(RIGHT($C8,1),$P$5:$Q$12,2,FALSE)","v":"Team 6"},null,null,null,null,null,null,"4.","25./26. Okt. 2025","4","Team 4",4,1,2,2,4,2,2,"-",1,14]
["2-4",3,"2-4",">",{"$f":"VLOOKUP(LEFT($C9,1),$P$5:$Q$12,2,FALSE)","v":"Team 2"},"-",{"$f":"VLOOKUP(RIGHT($C9,1),$P$5:$Q$12,2,FALSE)","v":"Team 4"},"Sa/So",null,"__.__","Uhr","__",null,"5.","01./02. Nov. 2025 (Samstag Allerheiligen Spielverbot bis 18.00 Uhr)","5","Team 5",5,2,1,3,2,3,"-",2,1,14]
["3-8",4,"3-8",null,{"$f":"VLOOKUP(LEFT($C10,1),$P$5:$Q$12,2,FALSE)","v":"Team 3"},"-",{"$f":"VLOOKUP(RIGHT($C10,1),$P$5:$Q$12,2,FALSE)","v":"Team 8"},null,null,null,null,null,null,"6.","15./16. Nov. 2025 (Sonntag Volkstrauertag Spielverbot bis 13.00 Uhr)","6","Team 6",6,3,"-",1,1,1,4,3,1,14]
[null,null,null,null,null,null,null,null,null,null,null,null,null,"7.","06./07. Dez. 2025","7","Team 7",7,1,2,2,"-","-",2,4,3,14]
[null,{"$f":"\"2.Spieltag, \"&$O$6","v":"2.Spieltag, 04./05. Okt. 2025"},null,null,null,null,null,null,null,null,null,null,null,"8.","20./21. Dez. 2025","8","Team 8",8,1,2,1,3,1,2,1,3,14]
["5-3",5,"5-3",">",{"$f":"VLOOKUP(LEFT($C13,1),$P$5:$Q$12,2,FALSE)","v":"Team 5"},"-",{"$f":"VLOOKUP(RIGHT($C13,1),$P$5:$Q$12,2,FALSE)","v":"Team 3"},"Sa/So",null,"__.__","Uhr","__",null,"9.","17./18. Jan. 2026",null,null,"Anzahl der Spiele Team bei:"]
["4-1",6,"4-1",null,{"$f":"VLOOKUP(LEFT($C14,1),$P$5:$Q$12,2,FALSE)","v":"Team 4"},"-",{"$f":"VLOOKUP(RIGHT($C14,1),$P$5:$Q$12,2,FALSE)","v":"Team 1"},null,null,null,null,null,null,"10.","24. Jan. 2026 (Sonntag Jugendspieltag)",null,null,null,1,2,3,4,5,6,7,8]
["8-6",7,"8-6",">",{"$f":"VLOOKUP(LEFT($C15,1),$P$5:$Q$12,2,FALSE)","v":"Team 8"},"-",{"$f":"VLOOKUP(RIGHT($C15,1),$P$5:$Q$12,2,FALSE)","v":"Team 6"},"Sa/So",null,"__.__","Uhr","__",null,"11.","31. Jan./01. Feb. 2026 (Sonntag 1. Runde Bezirkspokal bis OL)",null,null,null,{"$f":"SUM(S5:S12)","v":12},12,16,16,12,16,16,12]
["7-2",8,"7-2",null,{"$f":"VLOOKUP(LEFT($C16,1),$P$5:$Q$12,2,FALSE)","v":"Team 7"},"-",{"$f":"VLOOKUP(RIGHT($C16,1),$P$5:$Q$12,2,FALSE)","v":"Team 2"},null,null,null,null,null,null,"12.","21./22. Feb. 2026 (Sonntag 2. Runde Bezirkspokal)"]
[null,null,null,null,null,null,null,null,null,null,null,null,null,"13.","07./08. Mär. 2026"]
[null,{"$f":"\"3.Spieltag, \"&$O$7","v":"3.Spieltag, 11./12. Okt. 2025 (Sonntag WVV-Pokalfinale)"},null,null,null,null,null,null,null,null,null,null,null,"14.","21./22. Mär. 2026"]
["6-1",9,"6-1",">",{"$f":"VLOOKUP(LEFT($C19,1),$P$5:$Q$12,2,FALSE)","v":"Team 6"},"-",{"$f":"VLOOKUP(RIGHT($C19,1),$P$5:$Q$12,2,FALSE)","v":"Team 1"},"Sa/So",null,"__.__","Uhr","__"]
["5-7",10,"8-4",null,{"$f":"VLOOKUP(LEFT($C20,1),$P$5:$Q$12,2,FALSE)","v":"Team 8"},"-",{"$f":"VLOOKUP(RIGHT($C20,1),$P$5:$Q$12,2,FALSE)","v":"Team 4"}]
["3-2",11,"3-2",">",{"$f":"VLOOKUP(LEFT($C21,1),$P$5:$Q$12,2,FALSE)","v":"Team 3"},"-",{"$f":"VLOOKUP(RIGHT($C21,1),$P$5:$Q$12,2,FALSE)","v":"Team 2"},"Sa/So",null,"__.__","Uhr","__"]
["8-4",12,"5-7",null,{"$f":"VLOOKUP(LEFT($C22,1),$P$5:$Q$12,2,FALSE)","v":"Team 5"},"-",{"$f":"VLOOKUP(RIGHT($C22,1),$P$5:$Q$12,2,FALSE)","v":"Team 7"}]
[]
[null,{"$f":"\"4.Spieltag, \"&$O$8","v":"4.Spieltag, 25./26. Okt. 2025"}]
["7-8",13,"7-8",">",{"$f":"VLOOKUP(LEFT($C25,1),$P$5:$Q$12,2,FALSE)","v":"Team 7"},"-",{"$f":"VLOOKUP(RIGHT($C25,1),$P$5:$Q$12,2,FALSE)","v":"Team 8"},"Sa/So",null,"__.__","Uhr","__"]
["2-5",14,"2-5",null,{"$f":"VLOOKUP(LEFT($C26,1),$P$5:$Q$12,2,FALSE)","v":"Team 2"},"-",{"$f":"VLOOKUP(RIGHT($C26,1),$P$5:$Q$12,2,FALSE)","v":"Team 5"}]
["4-6",15,"4-6",">",{"$f":"VLOOKUP(LEFT($C27,1),$P$5:$Q$12,2,FALSE)","v":"Team 4"},"-",{"$f":"VLOOKUP(RIGHT($C27,1),$P$5:$Q$12,2,FALSE)","v":"Team 6"},"Sa/So",null,"__.__","Uhr","__"]
["1-3",16,"1-3",null,{"$f":"VLOOKUP(LEFT($C28,1),$P$5:$Q$12,2,FALSE)","v":"Team 1"},"-",{"$f":"VLOOKUP(RIGHT($C28,1),$P$5:$Q$12,2,FALSE)","v":"Team 3"}]
[]
[null,{"$f":"\"5.Spieltag, \"&$O$9","v":"5.Spieltag, 01./02. Nov. 2025 (Samstag Allerheiligen Spielverbot bis 18.00 Uhr)"}]
["8-2",17,"8-2",">",{"$f":"VLOOKUP(LEFT($C31,1),$P$5:$Q$12,2,FALSE)","v":"Team 8"},"-",{"$f":"VLOOKUP(RIGHT($C31,1),$P$5:$Q$12,2,FALSE)","v":"Team 2"},"So",null,"__.__","Uhr","__"]
["7-4",18,"4-7",null,{"$f":"VLOOKUP(LEFT($C32,1),$P$5:$Q$12,2,FALSE)","v":"Team 4"},"-",{"$f":"VLOOKUP(RIGHT($C32,1),$P$5:$Q$12,2,FALSE)","v":"Team 7"}]
["1-5",19,"1-5",">",{"$f":"VLOOKUP(LEFT($C33,1),$P$5:$Q$12,2,FALSE)","v":"Team 1"},"-",{"$f":"VLOOKUP(RIGHT($C33,1),$P$5:$Q$12,2,FALSE)","v":"Team 5"},"So",null,"__.__","Uhr","__"]
["6-3",20,"6-3",null,{"$f":"VLOOKUP(LEFT($C34,1),$P$5:$Q$12,2,FALSE)","v":"Team 6"},"-",{"$f":"VLOOKUP(RIGHT($C34,1),$P$5:$Q$12,2,FALSE)","v":"Team 3"}]
[]
[null,{"$f":"\"6.Spieltag, \"&$O$10","v":"6.Spieltag, 15./16. Nov. 2025 (Sonntag Volkstrauertag Spielverbot bis 13.00 Uhr)"}]
["3-4",21,"3-4",">",{"$f":"VLOOKUP(LEFT($C37,1),$P$5:$Q$12,2,FALSE)","v":"Team 3"},"-",{"$f":"VLOOKUP(RIGHT($C37,1),$P$5:$Q$12,2,FALSE)","v":"Team 4"},"Sa/So",null,"__.__","Uhr","__"]
["8-5",22,"8-5",null,{"$f":"VLOOKUP(LEFT($C38,1),$P$5:$Q$12,2,FALSE)","v":"Team 8"},"-",{"$f":"VLOOKUP(RIGHT($C38,1),$P$5:$Q$12,2,FALSE)","v":"Team 5"}]
["6-7",23,"6-7",">",{"$f":"VLOOKUP(LEFT($C39,1),$P$5:$Q$12,2,FALSE)","v":"Team 6"},"-",{"$f":"VLOOKUP(RIGHT($C39,1),$P$5:$Q$12,2,FALSE)","v":"Team 7"},"Sa/So",null,"__.__","Uhr","__"]
["2-1",24,"2-1",null,{"$f":"VLOOKUP(LEFT($C40,1),$P$5:$Q$12,2,FALSE)","v":"Team 2"},"-",{"$f":"VLOOKUP(RIGHT($C40,1),$P$5:$Q$12,2,FALSE)","v":"Team 1"}]
[]
[null,{"$f":"\"7.Spieltag, \"&$O$11","v":"7.Spieltag, 06./07. Dez. 2025"}]
["4-5",25,"4-5",">",{"$f":"VLOOKUP(LEFT($C43,1),$P$5:$Q$12,2,FALSE)","v":"Team 4"},"-",{"$f":"VLOOKUP(RIGHT($C43,1),$P$5:$Q$12,2,FALSE)","v":"Team 5"},"Sa/So",null,"__.__","Uhr","__"]
["1-8",26,"1-8",null,{"$f":"VLOOKUP(LEFT($C44,1),$P$5:$Q$12,2,FALSE)","v":"Team 1"},"-",{"$f":"VLOOKUP(RIGHT($C44,1),$P$5:$Q$12,2,FALSE)","v":"Team 8"}]
["7-3",27,"7-3",">",{"$f":"VLOOKUP(LEFT($C45,1),$P$5:$Q$12,2,FALSE)","v":"Team 7"},"-",{"$f":"VLOOKUP(RIGHT($C45,1),$P$5:$Q$12,2,FALSE)","v":"Team 3"},"Sa/So",null,"__.__","Uhr","__"]
["2-6",28,"6-2",null,{"$f":"VLOOKUP(LEFT($C46,1),$P$5:$Q$12,2,FALSE)","v":"Team 6"},"-",{"$f":"VLOOKUP(RIGHT($C46,1),$P$5:$Q$12,2,FALSE)","v":"Team 2"}]
[]
[null,"####   Mit   >   gekennzeichnete Mannschaften haben Heimrecht   ####"]
[]
[null,{"$f":"B4","v":"WVV-Spielplan: Liga x Frauen / Männer"},null,null,null,null,null,{"$f":"H4","v":"Saison 2025/26"},null,null,null,"Seite 2(2)"]
[null,null,null,null,null,null,null,null,null,null,null,"Halle"]
[null,{"$f":"\"8.Spieltag, \"&$O$12","v":"8.Spieltag, 20./21. Dez. 2025"}]
["7-1",29,"7-1",">",{"$f":"VLOOKUP(LEFT($C53,1),$P$5:$Q$12,2,FALSE)","v":"Team 7"},"-",{"$f":"VLOOKUP(RIGHT($C53,1),$P$5:$Q$12,2,FALSE)","v":"Team 1"},"Sa/So",null,"__.__","Uhr","__"]
["6-5",30,"6-5",null,{"$f":"VLOOKUP(LEFT($C54,1),$P$5:$Q$12,2,FALSE)","v":"Team 6"},"-",{"$f":"VLOOKUP(RIGHT($C54,1),$P$5:$Q$12,2,FALSE)","v":"Team 5"}]
["4-2",31,"4-2",">",{"$f":"VLOOKUP(LEFT($C55,1),$P$5:$Q$12,2,FALSE)","v":"Team 4"},"-",{"$f":"VLOOKUP(RIGHT($C55,1),$P$5:$Q$12,2,FALSE)","v":"Team 2"},"Sa/So",null,"__.__","Uhr","__"]
["8-3",32,"8-3",null,{"$f":"VLOOKUP(LEFT($C56,1),$P$5:$Q$12,2,FALSE)","v":"Team 8"},"-",{"$f":"VLOOKUP(RIGHT($C56,1),$P$5:$Q$12,2,FALSE)","v":"Team 3"}]
[]
[null,{"$f":"\"9.Spieltag, \"&$O$13","v":"9.Spieltag, 17./18. Jan. 2026"}]
["3-5",33,"3-5",">",{"$f":"VLOOKUP(LEFT($C59,1),$P$5:$Q$12,2,FALSE)","v":"Team 3"},"-",{"$f":"VLOOKUP(RIGHT($C59,1),$P$5:$Q$12,2,FALSE)","v":"Team 5"},"Sa/So",null,"__.__","Uhr","__"]
["1-4",34,"1-4",null,{"$f":"VLOOKUP(LEFT($C60,1),$P$5:$Q$12,2,FALSE)","v":"Team 1"},"-",{"$f":"VLOOKUP(RIGHT($C60,1),$P$5:$Q$12,2,FALSE)","v":"Team 4"}]
["6-8",35,"6-8",">",{"$f":"VLOOKUP(LEFT($C61,1),$P$5:$Q$12,2,FALSE)","v":"Team 6"},"-",{"$f":"VLOOKUP(RIGHT($C61,1),$P$5:$Q$12,2,FALSE)","v":"Team 8"},"Sa/So",null,"__.__","Uhr","__"]
["2-7",36,"2-7",null,{"$f":"VLOOKUP(LEFT($C62,1),$P$5:$Q$12,2,FALSE)","v":"Team 2"},"-",{"$f":"VLOOKUP(RIGHT($C62,1),$P$5:$Q$12,2,FALSE)","v":"Team 7"}]
[]
[null,{"$f":"\"10.Spieltag, \"&$O$14","v":"10.Spieltag, 24. Jan. 2026 (Sonntag Jugendspieltag)"}]
["1-6",37,"1-6",">",{"$f":"VLOOKUP(LEFT($C65,1),$P$5:$Q$12,2,FALSE)","v":"Team 1"},"-",{"$f":"VLOOKUP(RIGHT($C65,1),$P$5:$Q$12,2,FALSE)","v":"Team 6"},"Sa",null,"__.__","Uhr","__"]
["4-8",38,"4-8",null,{"$f":"VLOOKUP(LEFT($C66,1),$P$5:$Q$12,2,FALSE)","v":"Team 4"},"-",{"$f":"VLOOKUP(RIGHT($C66,1),$P$5:$Q$12,2,FALSE)","v":"Team 8"}]
["2-3",39,"2-3",">",{"$f":"VLOOKUP(LEFT($C67,1),$P$5:$Q$12,2,FALSE)","v":"Team 2"},"-",{"$f":"VLOOKUP(RIGHT($C67,1),$P$5:$Q$12,2,FALSE)","v":"Team 3"},"Sa",null,"__.__","Uhr","__"]
["7-5",40,"7-5",null,{"$f":"VLOOKUP(LEFT($C68,1),$P$5:$Q$12,2,FALSE)","v":"Team 7"},"-",{"$f":"VLOOKUP(RIGHT($C68,1),$P$5:$Q$12,2,FALSE)","v":"Team 5"}]
[]
[null,{"$f":"\"11.Spieltag, \"&$O$15","v":"11.Spieltag, 31. Jan./01. Feb. 2026 (Sonntag 1. Runde Bezirkspokal bis OL)"}]
["8-7",41,"8-7",">",{"$f":"VLOOKUP(LEFT($C71,1),$P$5:$Q$12,2,FALSE)","v":"Team 8"},"-",{"$f":"VLOOKUP(RIGHT($C71,1),$P$5:$Q$12,2,FALSE)","v":"Team 7"},"Sa/So",null,"__.__","Uhr","__"]
["3-1",42,"5-2",null,{"$f":"VLOOKUP(LEFT($C72,1),$P$5:$Q$12,2,FALSE)","v":"Team 5"},"-",{"$f":"VLOOKUP(RIGHT($C72,1),$P$5:$Q$12,2,FALSE)","v":"Team 2"}]
["6-4",43,"6-4",">",{"$f":"VLOOKUP(LEFT($C73,1),$P$5:$Q$12,2,FALSE)","v":"Team 6"},"-",{"$f":"VLOOKUP(RIGHT($C73,1),$P$5:$Q$12,2,FALSE)","v":"Team 4"},"Sa/So",null,"__.__","Uhr","__"]
["5-2",44,"3-1",null,{"$f":"VLOOKUP(LEFT($C74,1),$P$5:$Q$12,2,FALSE)","v":"Team 3"},"-",{"$f":"VLOOKUP(RIGHT($C74,1),$P$5:$Q$12,2,FALSE)","v":"Team 1"}]
[]
[null,{"$f":"\"12.Spieltag, \"&$O$16","v":"12.Spieltag, 21./22. Feb. 2026 (Sonntag 2. Runde Bezirkspokal)"}]
["2-8",45,"2-8",">",{"$f":"VLOOKUP(LEFT($C77,1),$P$5:$Q$12,2,FALSE)","v":"Team 2"},"-",{"$f":"VLOOKUP(RIGHT($C77,1),$P$5:$Q$12,2,FALSE)","v":"Team 8"},"Sa/So",null,"__.__","Uhr","__"]
["7-4",46,"7-4",null,{"$f":"VLOOKUP(LEFT($C78,1),$P$5:$Q$12,2,FALSE)","v":"Team 7"},"-",{"$f":"VLOOKUP(RIGHT($C78,1),$P$5:$Q$12,2,FALSE)","v":"Team 4"}]
["5-1",47,"5-1",">",{"$f":"VLOOKUP(LEFT($C79,1),$P$5:$Q$12,2,FALSE)","v":"Team 5"},"-",{"$f":"VLOOKUP(RIGHT($C79,1),$P$5:$Q$12,2,FALSE)","v":"Team 1"},"Sa/So",null,"__.__","Uhr","__"]
["3-6",48,"3-6",null,{"$f":"VLOOKUP(LEFT($C80,1),$P$5:$Q$12,2,FALSE)","v":"Team 3"},"-",{"$f":"VLOOKUP(RIGHT($C80,1),$P$5:$Q$12,2,FALSE)","v":"Team 6"}]
[]
[null,{"$f":"\"13.Spieltag, \"&$O$17","v":"13.Spieltag, 07./08. Mär. 2026"}]
["4-3",49,"4-3",">",{"$f":"VLOOKUP(LEFT($C83,1),$P$5:$Q$12,2,FALSE)","v":"Team 4"},"-",{"$f":"VLOOKUP(RIGHT($C83,1),$P$5:$Q$12,2,FALSE)","v":"Team 3"},"Sa/So",null,"__.__","Uhr","__"]
["1-2",50,"5-8",null,{"$f":"VLOOKUP(LEFT($C84,1),$P$5:$Q$12,2,FALSE)","v":"Team 5"},"-",{"$f":"VLOOKUP(RIGHT($C84,1),$P$5:$Q$12,2,FALSE)","v":"Team 8"}]
["7-6",51,"7-6",">",{"$f":"VLOOKUP(LEFT($C85,1),$P$5:$Q$12,2,FALSE)","v":"Team 7"},"-",{"$f":"VLOOKUP(RIGHT($C85,1),$P$5:$Q$12,2,FALSE)","v":"Team 6"},"Sa/So",null,"__.__","Uhr","__"]
["5-8",52,"1-2",null,{"$f":"VLOOKUP(LEFT($C86,1),$P$5:$Q$12,2,FALSE)","v":"Team 1"},"-",{"$f":"VLOOKUP(RIGHT($C86,1),$P$5:$Q$12,2,FALSE)","v":"Team 2"}]
[]
[null,{"$f":"\"14.Spieltag, \"&$O$18","v":"14.Spieltag, 21./22. Mär. 2026"}]
["5-4",53,"5-4",">",{"$f":"VLOOKUP(LEFT($C89,1),$P$5:$Q$12,2,FALSE)","v":"Team 5"},"-",{"$f":"VLOOKUP(RIGHT($C89,1),$P$5:$Q$12,2,FALSE)","v":"Team 4"},"Sa/So",null,"__.__","Uhr","__"]
["2-6",54,"8-1",null,{"$f":"VLOOKUP(LEFT($C90,1),$P$5:$Q$12,2,FALSE)","v":"Team 8"},"-",{"$f":"VLOOKUP(RIGHT($C90,1),$P$5:$Q$12,2,FALSE)","v":"Team 1"}]
["3-7",55,"3-7",">",{"$f":"VLOOKUP(LEFT($C91,1),$P$5:$Q$12,2,FALSE)","v":"Team 3"},"-",{"$f":"VLOOKUP(RIGHT($C91,1),$P$5:$Q$12,2,FALSE)","v":"Team 7"},"Sa/So",null,"__.__","Uhr","__"]
["8-1",56,"2-6",null,{"$f":"VLOOKUP(LEFT($C92,1),$P$5:$Q$12,2,FALSE)","v":"Team 2"},"-",{"$f":"VLOOKUP(RIGHT($C92,1),$P$5:$Q$12,2,FALSE)","v":"Team 6"}]
[]
[null,"Relegation: 01. – 03. Mai 2026"]
[]
[null,"####   Mit   >   gekennzeichnete Mannschaften haben Heimrecht   ####"]
[]
[]
[]
[]
[null,null,null,null,null,null,null,null,null,null,null," "]

{"sheet":"WVV 9 auf 18","index":3,"n_rows":117,"n_cols":29,"rows_kept":117,"cut":false,"hidden":false,"merged":[]}
[{"$f":"\"WVV-Spielplan: \"&N1","v":"WVV-Spielplan: Liga x Frauen / Männer"},null,null,null,null,null,"Saison 2025/26",null,null,null,"Seite 1(2)",null,null,"Liga x Frauen / Männer"]
[null,null,null,null,null,null,null,null,null,null,"Halle",null,"1.","20./21. Sept. 2025 (Sonntag WVV-Pokal)","1","Team 1"]
[{"$f":"\"1.Spieltag, \"&$N$2","v":"1.Spieltag, 20./21. Sept. 2025 (Sonntag WVV-Pokal)"},null,null,null,null,null,null,null,null,null,null,null,"2.","04./05. Okt. 2025","2","Team 2"]
[1,"5-3",">",{"$f":"VLOOKUP(LEFT($B4,1),$O$2:$P$10,2,FALSE)","v":"Team 5"},"-",{"$f":"VLOOKUP(RIGHT($B4,1),$O$2:$P$10,2,FALSE)","v":"Team 3"},"Sa/So",null,"___.___","Uhr","___",null,"3.","11./12. Okt. 2025 (Sonntag WVV-Pokalfinale)","3","Team 3"]
[2,"2-8",null,{"$f":"VLOOKUP(LEFT($B5,1),$O$2:$P$10,2,FALSE)","v":"Team 2"},"-",{"$f":"VLOOKUP(RIGHT($B5,1),$O$2:$P$10,2,FALSE)","v":"Team 8"},null,null,null,null,null,null,"4.","18./19. Okt. 2025","4","Team 4"]
[3,"7-9",">",{"$f":"VLOOKUP(LEFT($B6,1),$O$2:$P$10,2,FALSE)","v":"Team 7"},"-",{"$f":"VLOOKUP(RIGHT($B6,1),$O$2:$P$10,2,FALSE)","v":"Team 9"},"Sa/So",null,"___.___","Uhr","___",null,"5.","25./26. Okt. 2025","5","Team 5"]
[4,"4-6",null,{"$f":"VLOOKUP(LEFT($B7,1),$O$2:$P$10,2,FALSE)","v":"Team 4"},"-",{"$f":"VLOOKUP(RIGHT($B7,1),$O$2:$P$10,2,FALSE)","v":"Team 6"},null,null,null,null,null,null,"6.","01./02. Nov. 2025 (Samstag Allerheiligen Spielverbot bis 18.00 Uhr)","6","Team 6"]
[null,null,null,null,null,null,null,null,null,null,null,null,"7.","15./16. Nov. 2025 (Sonntag Volkstrauertag Spielverbot bis 13.00 Uhr)","7","Team 7"]
[{"$f":"\"2.Spieltag, \"&$N$3","v":"2.Spieltag, 04./05. Okt. 2025"},null,null,null,null,null,null,null,null,null,null,null,"8.","22. Nov. 2025 (Sonntag Totensonntag Spielverbot bis 18.00 Uhr)","8","Team 8"]
[5,"9-6",">",{"$f":"VLOOKUP(LEFT($B10,1),$O$2:$P$10,2,FALSE)","v":"Team 9"},"-",{"$f":"VLOOKUP(RIGHT($B10,1),$O$2:$P$10,2,FALSE)","v":"Team 6"},"Sa/So",null,"___.___","Uhr","___",null,"9.","06./07. Dez. 2025","9","Team 9"]
[6,"3-7",null,{"$f":"VLOOKUP(LEFT($B11,1),$O$2:$P$10,2,FALSE)","v":"Team 3"},"-",{"$f":"VLOOKUP(RIGHT($B11,1),$O$2:$P$10,2,FALSE)","v":"Team 7"},null,null,null,null,null,null,"10.","20./21. Dez. 2025"]
[7,"1-4",">",{"$f":"VLOOKUP(LEFT($B12,1),$O$2:$P$10,2,FALSE)","v":"Team 1"},"-",{"$f":"VLOOKUP(RIGHT($B12,1),$O$2:$P$10,2,FALSE)","v":"Team 4"},"Sa/So",null,"___.___","Uhr","___",null,"11.","10. Jan. 2026 (Sonntag Jugendspieltag)",null,null,null,"9er"]
[8,"8-5",null,{"$f":"VLOOKUP(LEFT($B13,1),$O$2:$P$10,2,FALSE)","v":"Team 8"},"-",{"$f":"VLOOKUP(RIGHT($B13,1),$O$2:$P$10,2,FALSE)","v":"Team 5"},null,null,null,null,null,null,"12.","17./18. Jan. 2026",null,"z.B.",null,1,2,3,4,5,6,7,8,9,"A","H","Ges"]
[null,null,null,null,null,null,null,null,null,null,null,null,"13.","24. Jan. 2026 (Sonntag Jugendspieltag)",null,"1 nie nach 9",1,"x",3,2,2,1,1,2,1,null,{"$f":"SUM(R14:Z14)","v":12},4,{"$f":"SUM(AA14:AB14)","v":16}]
[{"$f":"\"3.Spieltag, \"&$N$4","v":"3.Spieltag, 11./12. Okt. 2025 (Sonntag WVV-Pokalfinale)"},null,null,null,null,null,null,null,null,null,null,null,"14.","31. Jan./01. Feb. 2026 (Sonntag 1. Runde Bezirkspokal)",null,null,2,1,"x",1,1,4,1,2,1,1,{"$f":"SUM(R15:Z15)","v":12},4,{"$f":"SUM(AA15:AB15)","v":16}]
[9,"2-1",">",{"$f":"VLOOKUP(LEFT($B16,1),$O$2:$P$10,2,FALSE)","v":"Team 2"},"-",{"$f":"VLOOKUP(RIGHT($B16,1),$O$2:$P$10,2,FALSE)","v":"Team 1"},"Sa/So",null,"___.___","Uhr","___",null,"15.","14./15. Feb. 2026 (Sonntag Karneval)",null,null,3,1,1,"x",1,1,4,1,2,1,12,4,16]
[10,"5-9",null,{"$f":"VLOOKUP(LEFT($B17,1),$O$2:$P$10,2,FALSE)","v":"Team 5"},"-",{"$f":"VLOOKUP(RIGHT($B17,1),$O$2:$P$10,2,FALSE)","v":"Team 9"},null,null,null,null,null,null,"16.","21./22. Feb. 2026 (Sonntag 2. Runde Bezirkspokal)",null,null,4,2,null,2,"x",2,1,3,1,1,12,4,16]
[11,"4-8",">",{"$f":"VLOOKUP(LEFT($B18,1),$O$2:$P$10,2,FALSE)","v":"Team 4"},"-",{"$f":"VLOOKUP(RIGHT($B18,1),$O$2:$P$10,2,FALSE)","v":"Team 8"},"Sa/So",null,"___.___","Uhr","___",null,"17.","07./08. Mär. 2026",null,null,5,2,2,2,3,"x",null,1,1,1,12,4,16]
[12,"6-7",null,{"$f":"VLOOKUP(LEFT($B19,1),$O$2:$P$10,2,FALSE)","v":"Team 6"},"-",{"$f":"VLOOKUP(RIGHT($B19,1),$O$2:$P$10,2,FALSE)","v":"Team 7"},null,null,null,null,null,null,"18.","21./22. Mär. 2026",null,null,6,1,null,1,2,1,"x",1,3,3,12,4,16]
[null,null,null,null,null,null,null,null,null,null,null,null,null,null,null,null,7,1,2,1,1,1,2,"x",1,3,12,4,16]
[{"$f":"\"4.Spieltag, \"&$N$5","v":"4.Spieltag, 18./19. Okt. 2025"},null,null,null,null,null,null,null,null,null,null,null,null,null,null,null,8,1,2,2,2,2,1,null,"x",2,12,4,16]
[13,"7-2",">",{"$f":"VLOOKUP(LEFT($B22,1),$O$2:$P$10,2,FALSE)","v":"Team 7"},"-",{"$f":"VLOOKUP(RIGHT($B22,1),$O$2:$P$10,2,FALSE)","v":"Team 2"},"Sa/So",null,"___.___","Uhr","___",null,null,null,null,"9 nie nach 4 & 5",9,3,2,1,null,null,2,2,2,"x",12,4,16]
[14,"1-3",null,{"$f":"VLOOKUP(LEFT($B23,1),$O$2:$P$10,2,FALSE)","v":"Team 1"},"-",{"$f":"VLOOKUP(RIGHT($B23,1),$O$2:$P$10,2,FALSE)","v":"Team 3"},null,null,null,null,null,null,null,null,null,null,null,{"$f":"SUM(R14:R22)","v":12},12,12,12,12,12,12,12,12]
[15,"8-9",">",{"$f":"VLOOKUP(LEFT($B24,1),$O$2:$P$10,2,FALSE)","v":"Team 8"},"-",{"$f":"VLOOKUP(RIGHT($B24,1),$O$2:$P$10,2,FALSE)","v":"Team 9"},"Sa/So",null,"___.___","Uhr","___"]
[16,"6-5",null,{"$f":"VLOOKUP(LEFT($B25,1),$O$2:$P$10,2,FALSE)","v":"Team 6"},"-",{"$f":"VLOOKUP(RIGHT($B25,1),$O$2:$P$10,2,FALSE)","v":"Team 5"}]
[]
[{"$f":"\"5.Spieltag, \"&$N$6","v":"5.Spieltag, 25./26. Okt. 2025"}]
[17,"1-7",">",{"$f":"VLOOKUP(LEFT($B28,1),$O$2:$P$10,2,FALSE)","v":"Team 1"},"-",{"$f":"VLOOKUP(RIGHT($B28,1),$O$2:$P$10,2,FALSE)","v":"Team 7"},"Sa/So",null,"___.___","Uhr","___"]
[18,"9-4",null,{"$f":"VLOOKUP(LEFT($B29,1),$O$2:$P$10,2,FALSE)","v":"Team 9"},"-",{"$f":"VLOOKUP(RIGHT($B29,1),$O$2:$P$10,2,FALSE)","v":"Team 4"}]
[19,"6-8",">",{"$f":"VLOOKUP(LEFT($B30,1),$O$2:$P$10,2,FALSE)","v":"Team 6"},"-",{"$f":"VLOOKUP(RIGHT($B30,1),$O$2:$P$10,2,FALSE)","v":"Team 8"},"Sa/So",null,"___.___","Uhr","___"]
[20,"2-3",null,{"$f":"VLOOKUP(LEFT($B31,1),$O$2:$P$10,2,FALSE)","v":"Team 2"},"-",{"$f":"VLOOKUP(RIGHT($B31,1),$O$2:$P$10,2,FALSE)","v":"Team 3"}]
[]
[{"$f":"\"6.Spieltag, \"&$N$7","v":"6.Spieltag, 01./02. Nov. 2025 (Samstag Allerheiligen Spielverbot bis 18.00 Uhr)"}]
[21,"3-4",">",{"$f":"VLOOKUP(LEFT($B34,1),$O$2:$P$10,2,FALSE)","v":"Team 3"},"-",{"$f":"VLOOKUP(RIGHT($B34,1),$O$2:$P$10,2,FALSE)","v":"Team 4"},"So",null,"___.___","Uhr","___"]
[22,"5-1",null,{"$f":"VLOOKUP(LEFT($B35,1),$O$2:$P$10,2,FALSE)","v":"Team 5"},"-",{"$f":"VLOOKUP(RIGHT($B35,1),$O$2:$P$10,2,FALSE)","v":"Team 1"}]
[23,"9-2",">",{"$f":"VLOOKUP(LEFT($B36,1),$O$2:$P$10,2,FALSE)","v":"Team 9"},"-",{"$f":"VLOOKUP(RIGHT($B36,1),$O$2:$P$10,2,FALSE)","v":"Team 2"},"So",null,"___.___","Uhr","___"]
[24,"7-8",null,{"$f":"VLOOKUP(LEFT($B37,1),$O$2:$P$10,2,FALSE)","v":"Team 7"},"-",{"$f":"VLOOKUP(RIGHT($B37,1),$O$2:$P$10,2,FALSE)","v":"Team 8"}]
[]
[{"$f":"\"7.Spieltag, \"&$N$8","v":"7.Spieltag, 15./16. Nov. 2025 (Sonntag Volkstrauertag Spielverbot bis 13.00 Uhr)"}]
[25,"8-3",">",{"$f":"VLOOKUP(LEFT($B40,1),$O$2:$P$10,2,FALSE)","v":"Team 8"},"-",{"$f":"VLOOKUP(RIGHT($B40,1),$O$2:$P$10,2,FALSE)","v":"Team 3"},"Sa/So",null,"___.___","Uhr","___"]
[26,"1-9",null,{"$f":"VLOOKUP(LEFT($B41,1),$O$2:$P$10,2,FALSE)","v":"Team 1"},"-",{"$f":"VLOOKUP(RIGHT($B41,1),$O$2:$P$10,2,FALSE)","v":"Team 9"}]
[27,"4-5",">",{"$f":"VLOOKUP(LEFT($B42,1),$O$2:$P$10,2,FALSE)","v":"Team 4"},"-",{"$f":"VLOOKUP(RIGHT($B42,1),$O$2:$P$10,2,FALSE)","v":"Team 5"},"Sa/So",null,"___.___","Uhr","___"]
[28,"2-6",null,{"$f":"VLOOKUP(LEFT($B43,1),$O$2:$P$10,2,FALSE)","v":"Team 2"},"-",{"$f":"VLOOKUP(RIGHT($B43,1),$O$2:$P$10,2,FALSE)","v":"Team 6"}]
[]
[{"$f":"\"8.Spieltag, \"&$N$9","v":"8.Spieltag, 22. Nov. 2025 (Sonntag Totensonntag Spielverbot bis 18.00 Uhr)"}]
[29,"6-1",">",{"$f":"VLOOKUP(LEFT($B46,1),$O$2:$P$10,2,FALSE)","v":"Team 6"},"-",{"$f":"VLOOKUP(RIGHT($B46,1),$O$2:$P$10,2,FALSE)","v":"Team 1"},"Sa",null,"___.___","Uhr","___"]
[30,"9-3",null,{"$f":"VLOOKUP(LEFT($B47,1),$O$2:$P$10,2,FALSE)","v":"Team 9"},"-",{"$f":"VLOOKUP(RIGHT($B47,1),$O$2:$P$10,2,FALSE)","v":"Team 3"}]
[31,"5-7",">",{"$f":"VLOOKUP(LEFT($B48,1),$O$2:$P$10,2,FALSE)","v":"Team 5"},"-",{"$f":"VLOOKUP(RIGHT($B48,1),$O$2:$P$10,2,FALSE)","v":"Team 7"},"Sa",null,"___.___","Uhr","___"]
[32,"4-2",null,{"$f":"VLOOKUP(LEFT($B49,1),$O$2:$P$10,2,FALSE)","v":"Team 4"},"-",{"$f":"VLOOKUP(RIGHT($B49,1),$O$2:$P$10,2,FALSE)","v":"Team 2"}]
[]
[{"$f":"\"9.Spieltag, \"&$N$10","v":"9.Spieltag, 06./07. Dez. 2025"}]
[33,"2-5",">",{"$f":"VLOOKUP(LEFT($B52,1),$O$2:$P$10,2,FALSE)","v":"Team 2"},"-",{"$f":"VLOOKUP(RIGHT($B52,1),$O$2:$P$10,2,FALSE)","v":"Team 5"},"Sa/So",null,"___.___","Uhr","___"]
[34,"1-8",null,{"$f":"VLOOKUP(LEFT($B53,1),$O$2:$P$10,2,FALSE)","v":"Team 1"},"-",{"$f":"VLOOKUP(RIGHT($B53,1),$O$2:$P$10,2,FALSE)","v":"Team 8"}]
[35,"3-6",">",{"$f":"VLOOKUP(LEFT($B54,1),$O$2:$P$10,2,FALSE)","v":"Team 3"},"-",{"$f":"VLOOKUP(RIGHT($B54,1),$O$2:$P$10,2,FALSE)","v":"Team 6"},"Sa/So",null,"___.___","Uhr","___"]
[36,"7-4",null,{"$f":"VLOOKUP(LEFT($B55,1),$O$2:$P$10,2,FALSE)","v":"Team 7"},"-",{"$f":"VLOOKUP(RIGHT($B55,1),$O$2:$P$10,2,FALSE)","v":"Team 4"}]
[]
["####  Mit   >   gekennzeichnete Mannschaften haben Heimrecht   ####"]
[]
[{"$f":"$A$1","v":"WVV-Spielplan: Liga x Frauen / Männer"},null,null,null,null,null,{"$f":"$G$1","v":"Saison 2025/26"},null,null,null,"Seite 2(2)"]
[null,null,null,null,null,null,null,null,null,null,"Halle"]
[{"$f":"\"10.Spieltag, \"&$N$11","v":"10.Spieltag, 20./21. Dez. 2025"}]
[37,"3-5",">",{"$f":"VLOOKUP(LEFT($B62,1),$O$2:$P$10,2,FALSE)","v":"Team 3"},"-",{"$f":"VLOOKUP(RIGHT($B62,1),$O$2:$P$10,2,FALSE)","v":"Team 5"},"Sa/So",null,"___.___","Uhr","___"]
[38,"8-2",null,{"$f":"VLOOKUP(LEFT($B63,1),$O$2:$P$10,2,FALSE)","v":"Team 8"},"-",{"$f":"VLOOKUP(RIGHT($B63,1),$O$2:$P$10,2,FALSE)","v":"Team 2"}]
[39,"9-7",">",{"$f":"VLOOKUP(LEFT($B64,1),$O$2:$P$10,2,FALSE)","v":"Team 9"},"-",{"$f":"VLOOKUP(RIGHT($B64,1),$O$2:$P$10,2,FALSE)","v":"Team 7"},"Sa/So",null,"___.___","Uhr","___"]
[40,"6-4",null,{"$f":"VLOOKUP(LEFT($B65,1),$O$2:$P$10,2,FALSE)","v":"Team 6"},"-",{"$f":"VLOOKUP(RIGHT($B65,1),$O$2:$P$10,2,FALSE)","v":"Team 4"}]
[]
[{"$f":"\"11.Spieltag, \"&$N$12","v":"11.Spieltag, 10. Jan. 2026 (Sonntag Jugendspieltag)"}]
[41,"6-9",">",{"$f":"VLOOKUP(LEFT($B68,1),$O$2:$P$10,2,FALSE)","v":"Team 6"},"-",{"$f":"VLOOKUP(RIGHT($B68,1),$O$2:$P$10,2,FALSE)","v":"Team 9"},"Sa",null,"___.___","Uhr","___"]
[42,"7-3",null,{"$f":"VLOOKUP(LEFT($B69,1),$O$2:$P$10,2,FALSE)","v":"Team 7"},"-",{"$f":"VLOOKUP(RIGHT($B69,1),$O$2:$P$10,2,FALSE)","v":"Team 3"}]
[43,"4-1",">",{"$f":"VLOOKUP(LEFT($B70,1),$O$2:$P$10,2,FALSE)","v":"Team 4"},"-",{"$f":"VLOOKUP(RIGHT($B70,1),$O$2:$P$10,2,FALSE)","v":"Team 1"},"Sa",null,"___.___","Uhr","___"]
[44,"5-8",null,{"$f":"VLOOKUP(LEFT($B71,1),$O$2:$P$10,2,FALSE)","v":"Team 5"},"-",{"$f":"VLOOKUP(RIGHT($B71,1),$O$2:$P$10,2,FALSE)","v":"Team 8"}]
[]
[{"$f":"\"12.Spieltag, \"&$N$13","v":"12.Spieltag, 17./18. Jan. 2026"}]
[45,"1-2",">",{"$f":"VLOOKUP(LEFT($B74,1),$O$2:$P$10,2,FALSE)","v":"Team 1"},"-",{"$f":"VLOOKUP(RIGHT($B74,1),$O$2:$P$10,2,FALSE)","v":"Team 2"},"Sa/So",null,"___.___","Uhr","___"]
[46,"9-5",null,{"$f":"VLOOKUP(LEFT($B75,1),$O$2:$P$10,2,FALSE)","v":"Team 9"},"-",{"$f":"VLOOKUP(RIGHT($B75,1),$O$2:$P$10,2,FALSE)","v":"Team 5"}]
[47,"8-4",">",{"$f":"VLOOKUP(LEFT($B76,1),$O$2:$P$10,2,FALSE)","v":"Team 8"},"-",{"$f":"VLOOKUP(RIGHT($B76,1),$O$2:$P$10,2,FALSE)","v":"Team 4"},"Sa/So",null,"___.___","Uhr","___"]
[48,"7-6",null,{"$f":"VLOOKUP(LEFT($B77,1),$O$2:$P$10,2,FALSE)","v":"Team 7"},"-",{"$f":"VLOOKUP(RIGHT($B77,1),$O$2:$P$10,2,FALSE)","v":"Team 6"}]
[]
[{"$f":"\"13.Spieltag, \"&$N$14","v":"13.Spieltag, 24. Jan. 2026 (Sonntag Jugendspieltag)"}]
[49,"2-7",">",{"$f":"VLOOKUP(LEFT($B80,1),$O$2:$P$10,2,FALSE)","v":"Team 2"},"-",{"$f":"VLOOKUP(RIGHT($B80,1),$O$2:$P$10,2,FALSE)","v":"Team 7"},"Sa",null,"___.___","Uhr","___"]
[50,"3-1",null,{"$f":"VLOOKUP(LEFT($B81,1),$O$2:$P$10,2,FALSE)","v":"Team 3"},"-",{"$f":"VLOOKUP(RIGHT($B81,1),$O$2:$P$10,2,FALSE)","v":"Team 1"}]
[51,"9-8",">",{"$f":"VLOOKUP(LEFT($B82,1),$O$2:$P$10,2,FALSE)","v":"Team 9"},"-",{"$f":"VLOOKUP(RIGHT($B82,1),$O$2:$P$10,2,FALSE)","v":"Team 8"},"Sa",null,"___.___","Uhr","___"]
[52,"5-6",null,{"$f":"VLOOKUP(LEFT($B83,1),$O$2:$P$10,2,FALSE)","v":"Team 5"},"-",{"$f":"VLOOKUP(RIGHT($B83,1),$O$2:$P$10,2,FALSE)","v":"Team 6"}]
[]
[{"$f":"\"14.Spieltag, \"&$N$15","v":"14.Spieltag, 31. Jan./01. Feb. 2026 (Sonntag 1. Runde Bezirkspokal)"}]
[53,"7-1",">",{"$f":"VLOOKUP(LEFT($B86,1),$O$2:$P$10,2,FALSE)","v":"Team 7"},"-",{"$f":"VLOOKUP(RIGHT($B86,1),$O$2:$P$10,2,FALSE)","v":"Team 1"},"Sa/So",null,"___.___","Uhr","___"]
[54,"4-9",null,{"$f":"VLOOKUP(LEFT($B87,1),$O$2:$P$10,2,FALSE)","v":"Team 4"},"-",{"$f":"VLOOKUP(RIGHT($B87,1),$O$2:$P$10,2,FALSE)","v":"Team 9"}]
[55,"8-6",">",{"$f":"VLOOKUP(LEFT($B88,1),$O$2:$P$10,2,FALSE)","v":"Team 8"},"-",{"$f":"VLOOKUP(RIGHT($B88,1),$O$2:$P$10,2,FALSE)","v":"Team 6"},"Sa/So",null,"___.___","Uhr","___"]
[56,"3-2",null,{"$f":"VLOOKUP(LEFT($B89,1),$O$2:$P$10,2,FALSE)","v":"Team 3"},"-",{"$f":"VLOOKUP(RIGHT($B89,1),$O$2:$P$10,2,FALSE)","v":"Team 2"}]
[]
[{"$f":"\"15.Spieltag, \"&$N$16","v":"15.Spieltag, 14./15. Feb. 2026 (Sonntag Karneval)"}]
[57,"4-3",">",{"$f":"VLOOKUP(LEFT($B92,1),$O$2:$P$10,2,FALSE)","v":"Team 4"},"-",{"$f":"VLOOKUP(RIGHT($B92,1),$O$2:$P$10,2,FALSE)","v":"Team 3"},"Sa/So",null,"___.___","Uhr","___"]
[58,"1-5",null,{"$f":"VLOOKUP(LEFT($B93,1),$O$2:$P$10,2,FALSE)","v":"Team 1"},"-",{"$f":"VLOOKUP(RIGHT($B93,1),$O$2:$P$10,2,FALSE)","v":"Team 5"}]
[59,"2-9",">",{"$f":"VLOOKUP(LEFT($B94,1),$O$2:$P$10,2,FALSE)","v":"Team 2"},"-",{"$f":"VLOOKUP(RIGHT($B94,1),$O$2:$P$10,2,FALSE)","v":"Team 9"},"Sa/So",null,"___.___","Uhr","___"]
[60,"8-7",null,{"$f":"VLOOKUP(LEFT($B95,1),$O$2:$P$10,2,FALSE)","v":"Team 8"},"-",{"$f":"VLOOKUP(RIGHT($B95,1),$O$2:$P$10,2,FALSE)","v":"Team 7"}]
[]
[{"$f":"\"16.Spieltag, \"&$N$17","v":"16.Spieltag, 21./22. Feb. 2026 (Sonntag 2. Runde Bezirkspokal)"}]
[61,"3-8",">",{"$f":"VLOOKUP(LEFT($B98,1),$O$2:$P$10,2,FALSE)","v":"Team 3"},"-",{"$f":"VLOOKUP(RIGHT($B98,1),$O$2:$P$10,2,FALSE)","v":"Team 8"},"Sa/So",null,"___.___","Uhr","___"]
[62,"9-1",null,{"$f":"VLOOKUP(LEFT($B99,1),$O$2:$P$10,2,FALSE)","v":"Team 9"},"-",{"$f":"VLOOKUP(RIGHT($B99,1),$O$2:$P$10,2,FALSE)","v":"Team 1"}]
[63,"5-4",">",{"$f":"VLOOKUP(LEFT($B100,1),$O$2:$P$10,2,FALSE)","v":"Team 5"},"-",{"$f":"VLOOKUP(RIGHT($B100,1),$O$2:$P$10,2,FALSE)","v":"Team 4"},"Sa/So",null,"___.___","Uhr","___"]
[64,"6-2",null,{"$f":"VLOOKUP(LEFT($B101,1),$O$2:$P$10,2,FALSE)","v":"Team 6"},"-",{"$f":"VLOOKUP(RIGHT($B101,1),$O$2:$P$10,2,FALSE)","v":"Team 2"}]
[]
[{"$f":"\"17.Spieltag, \"&$N$18","v":"17.Spieltag, 07./08. Mär. 2026"}]
[65,"1-6",">",{"$f":"VLOOKUP(LEFT($B104,1),$O$2:$P$10,2,FALSE)","v":"Team 1"},"-",{"$f":"VLOOKUP(RIGHT($B104,1),$O$2:$P$10,2,FALSE)","v":"Team 6"},"Sa/So",null,"___.___","Uhr","___"]
[66,"3-9",null,{"$f":"VLOOKUP(LEFT($B105,1),$O$2:$P$10,2,FALSE)","v":"Team 3"},"-",{"$f":"VLOOKUP(RIGHT($B105,1),$O$2:$P$10,2,FALSE)","v":"Team 9"}]
[67,"7-5",">",{"$f":"VLOOKUP(LEFT($B106,1),$O$2:$P$10,2,FALSE)","v":"Team 7"},"-",{"$f":"VLOOKUP(RIGHT($B106,1),$O$2:$P$10,2,FALSE)","v":"Team 5"},"Sa/So",null,"___.___","Uhr","___"]
[68,"2-4",null,{"$f":"VLOOKUP(LEFT($B107,1),$O$2:$P$10,2,FALSE)","v":"Team 2"},"-",{"$f":"VLOOKUP(RIGHT($B107,1),$O$2:$P$10,2,FALSE)","v":"Team 4"}]
[]
[{"$f":"\"18.Spieltag, \"&$N$19","v":"18.Spieltag, 21./22. Mär. 2026"}]
[69,"5-2",">",{"$f":"VLOOKUP(LEFT($B110,1),$O$2:$P$10,2,FALSE)","v":"Team 5"},"-",{"$f":"VLOOKUP(RIGHT($B110,1),$O$2:$P$10,2,FALSE)","v":"Team 2"},"Sa/So",null,"___.___","Uhr","___"]
[70,"8-1",null,{"$f":"VLOOKUP(LEFT($B111,1),$O$2:$P$10,2,FALSE)","v":"Team 8"},"-",{"$f":"VLOOKUP(RIGHT($B111,1),$O$2:$P$10,2,FALSE)","v":"Team 1"}]
[71,"6-3",">",{"$f":"VLOOKUP(LEFT($B112,1),$O$2:$P$10,2,FALSE)","v":"Team 6"},"-",{"$f":"VLOOKUP(RIGHT($B112,1),$O$2:$P$10,2,FALSE)","v":"Team 3"},"Sa/So",null,"___.___","Uhr","___"]
[72,"4-7",null,{"$f":"VLOOKUP(LEFT($B113,1),$O$2:$P$10,2,FALSE)","v":"Team 4"},"-",{"$f":"VLOOKUP(RIGHT($B113,1),$O$2:$P$10,2,FALSE)","v":"Team 7"}]
[]
["Relegation: 01. – 03. Mai 2026"]
[]
["####  Mit   >   gekennzeichnete Mannschaften haben Heimrecht   ####"]

{"sheet":"WVV 10 auf 18","index":4,"n_rows":134,"n_cols":30,"rows_kept":134,"cut":false,"hidden":false,"merged":[]}
[{"$f":"\"WVV-Spielplan: \"&N1","v":"WVV-Spielplan: Liga x Frauen / Männer"},null,null,null,null,null,"Saison 2025/26",null,null,null,"Seite 1(2)",null,null,"Liga x Frauen / Männer"]
[null,null,null,null,null,null,null,null,null,null,"Halle",null,"1.","20./21. Sept. 2025 (Sonntag WVV-Pokal)","1","Team 1"]
["1.Spieltag",null,null,{"$f":"$N$2","v":"20./21. Sept. 2025 (Sonntag WVV-Pokal)"},null,null,null,null,null,null,null,null,"2.","04./05. Okt. 2025","2","Team 2"]
[1,"1-2",">",{"$f":"VLOOKUP(LEFT($B4,SEARCH(\"-\",$B4)-1),$O$2:$P$11,2,FALSE)","v":"Team 1"},"-",{"$f":"VLOOKUP(RIGHT($B4,LEN($B4)-SEARCH(\"-\",$B4)),$O$2:$P$11,2,FALSE)","v":"Team 2"},"Sa/So",null,"__.__","Uhr","__",null,"3.","11./12. Okt. 2025 (Sonntag WVV-Pokalfinale)","3","Team 3"]
[{"$f":"A4+1","v":2},"10-9",null,{"$f":"VLOOKUP(LEFT($B5,SEARCH(\"-\",$B5)-1),$O$2:$P$11,2,FALSE)","v":"Team 10"},"-",{"$f":"VLOOKUP(RIGHT($B5,LEN($B5)-SEARCH(\"-\",$B5)),$O$2:$P$11,2,FALSE)","v":"Team 9"},null,null,null,null,null,null,"4.","18./19. Okt. 2025","4","Team 4"]
[{"$f":"A5+1","v":3},"3-4",">",{"$f":"VLOOKUP(LEFT($B6,SEARCH(\"-\",$B6)-1),$O$2:$P$11,2,FALSE)","v":"Team 3"},"-",{"$f":"VLOOKUP(RIGHT($B6,LEN($B6)-SEARCH(\"-\",$B6)),$O$2:$P$11,2,FALSE)","v":"Team 4"},"Sa/So",null,"__.__","Uhr","__",null,"5.","25./26. Okt. 2025","5","Team 5"]
[{"$f":"A6+1","v":4},"5-6",null,{"$f":"VLOOKUP(LEFT($B7,SEARCH(\"-\",$B7)-1),$O$2:$P$11,2,FALSE)","v":"Team 5"},"-",{"$f":"VLOOKUP(RIGHT($B7,LEN($B7)-SEARCH(\"-\",$B7)),$O$2:$P$11,2,FALSE)","v":"Team 6"},null,null,null,null,null,null,"6.","01./02. Nov. 2025 (Samstag Allerheiligen Spielverbot bis 18.00 Uhr)","6","Team 6"]
[{"$f":"A7+1","v":5},"7-8",">",{"$f":"VLOOKUP(LEFT($B8,SEARCH(\"-\",$B8)-1),$O$2:$P$11,2,FALSE)","v":"Team 7"},"-",{"$f":"VLOOKUP(RIGHT($B8,LEN($B8)-SEARCH(\"-\",$B8)),$O$2:$P$11,2,FALSE)","v":"Team 8"},"Sa/So",null,"__.__","Uhr","__",null,"7.","15./16. Nov. 2025 (Sonntag Volkstrauertag Spielverbot bis 13.00 Uhr)","7","Team 7"]
[null,null,null,null,null,null,null,null,null,null,null,null,"8.","22. Nov. 2025 (Sonntag Totensonntag Spielverbot bis 18.00 Uhr)","8","Team 8"]
["2.Spieltag",null,null,{"$f":"$N$3","v":"04./05. Okt. 2025"},null,null,null,null,null,null,null,null,"9.","06./07. Dez. 2025","9","Team 9"]
[6,"5-7",">",{"$f":"VLOOKUP(LEFT($B11,SEARCH(\"-\",$B11)-1),$O$2:$P$11,2,FALSE)","v":"Team 5"},"-",{"$f":"VLOOKUP(RIGHT($B11,LEN($B11)-SEARCH(\"-\",$B11)),$O$2:$P$11,2,FALSE)","v":"Team 7"},"Sa/So",null,"__.__","Uhr","__",null,"10.","20./21. Dez. 2025","10","Team 10"]
[{"$f":"A11+1","v":7},"1-3",null,{"$f":"VLOOKUP(LEFT($B12,SEARCH(\"-\",$B12)-1),$O$2:$P$11,2,FALSE)","v":"Team 1"},"-",{"$f":"VLOOKUP(RIGHT($B12,LEN($B12)-SEARCH(\"-\",$B12)),$O$2:$P$11,2,FALSE)","v":"Team 3"},null,null,null,null,null,null,"11.","10. Jan. 2026 (Sonntag Jugendspieltag)"]
[{"$f":"A12+1","v":8},"6-10",">",{"$f":"VLOOKUP(LEFT($B13,SEARCH(\"-\",$B13)-1),$O$2:$P$11,2,FALSE)","v":"Team 6"},"-",{"$f":"VLOOKUP(RIGHT($B13,LEN($B13)-SEARCH(\"-\",$B13)),$O$2:$P$11,2,FALSE)","v":"Team 10"},"Sa/So",null,"__.__","Uhr","__",null,"12.","17./18. Jan. 2026"]
[{"$f":"A13+1","v":9},"2-4",null,{"$f":"VLOOKUP(LEFT($B14,SEARCH(\"-\",$B14)-1),$O$2:$P$11,2,FALSE)","v":"Team 2"},"-",{"$f":"VLOOKUP(RIGHT($B14,LEN($B14)-SEARCH(\"-\",$B14)),$O$2:$P$11,2,FALSE)","v":"Team 4"},null,null,null,null,null,null,"13.","24. Jan. 2026 (Sonntag Jugendspieltag)",null,null,null,"9er"]
[{"$f":"A14+1","v":10},"8-9",">",{"$f":"VLOOKUP(LEFT($B15,SEARCH(\"-\",$B15)-1),$O$2:$P$11,2,FALSE)","v":"Team 8"},"-",{"$f":"VLOOKUP(RIGHT($B15,LEN($B15)-SEARCH(\"-\",$B15)),$O$2:$P$11,2,FALSE)","v":"Team 9"},"Sa/So",null,"__.__","Uhr","__",null,"14.","31. Jan./01. Feb. 2026 (Sonntag 1. Runde Bezirkspokal bis OL)",null,"z.B.",null,1,2,3,4,5,6,7,8,9,10,"A","H","Ges"]
[null,null,null,null,null,null,null,null,null,null,null,null,"15.","14./15. Feb. 2026 (Sonntag Karneval)",null,"1 nie nach 8",1,"x",1,null,2,3,null,3,null,2,1,{"$f":"SUM(R16:AA16)","v":12},6,{"$f":"SUM(AB16:AC16)","v":18}]
["3.Spieltag",null,null,{"$f":"$N$4","v":"11./12. Okt. 2025 (Sonntag WVV-Pokalfinale)"},null,null,null,null,null,null,null,null,"16.","21./22. Feb. 2026 (Sonntag 2. Runde Bezirkspokal)",null,null,2,2,"x",2,null,null,2,1,2,null,3,{"$f":"SUM(R17:AA17)","v":12},6,{"$f":"SUM(AB17:AC17)","v":18}]
[11,"2-3",">",{"$f":"VLOOKUP(LEFT($B18,SEARCH(\"-\",$B18)-1),$O$2:$P$11,2,FALSE)","v":"Team 2"},"-",{"$f":"VLOOKUP(RIGHT($B18,LEN($B18)-SEARCH(\"-\",$B18)),$O$2:$P$11,2,FALSE)","v":"Team 3"},"Sa/So",null,"__.__","Uhr","__",null,"17.","07./08. Mär. 2026",null,null,3,1,2,"x",1,2,null,1,3,2,1,13,5,18]
[{"$f":"A18+1","v":12},"8-5",null,{"$f":"VLOOKUP(LEFT($B19,SEARCH(\"-\",$B19)-1),$O$2:$P$11,2,FALSE)","v":"Team 8"},"-",{"$f":"VLOOKUP(RIGHT($B19,LEN($B19)-SEARCH(\"-\",$B19)),$O$2:$P$11,2,FALSE)","v":"Team 5"},null,null,null,null,null,null,"18.","21./22. Mär. 2026",null,null,4,2,1,1,"x",2,3,1,1,null,2,13,5,18]
[{"$f":"A19+1","v":13},"9-6",">",{"$f":"VLOOKUP(LEFT($B20,SEARCH(\"-\",$B20)-1),$O$2:$P$11,2,FALSE)","v":"Team 9"},"-",{"$f":"VLOOKUP(RIGHT($B20,LEN($B20)-SEARCH(\"-\",$B20)),$O$2:$P$11,2,FALSE)","v":"Team 6"},"Sa/So",null,"__.__","Uhr","__",null,null,null,null,null,5,1,1,4,3,"x",1,1,1,null,1,13,5,18]
[{"$f":"A20+1","v":14},"7-10",null,{"$f":"VLOOKUP(LEFT($B21,SEARCH(\"-\",$B21)-1),$O$2:$P$11,2,FALSE)","v":"Team 7"},"-",{"$f":"VLOOKUP(RIGHT($B21,LEN($B21)-SEARCH(\"-\",$B21)),$O$2:$P$11,2,FALSE)","v":"Team 10"},null,null,null,null,null,null,null,null,null,null,6,1,2,1,2,null,"x",1,1,3,2,13,5,18]
[{"$f":"A21+1","v":15},"4-1",">",{"$f":"VLOOKUP(LEFT($B22,SEARCH(\"-\",$B22)-1),$O$2:$P$11,2,FALSE)","v":"Team 4"},"-",{"$f":"VLOOKUP(RIGHT($B22,LEN($B22)-SEARCH(\"-\",$B22)),$O$2:$P$11,2,FALSE)","v":"Team 1"},"Sa/So",null,"__.__","Uhr","__",null,null,null,null,null,7,1,2,null,null,1,2,"x",3,2,2,13,5,18]
[null,null,null,null,null,null,null,null,null,null,null,null,null,null,null,null,8,null,3,2,1,1,1,2,"x",1,1,12,6,18]
["4.Spieltag",null,null,{"$f":"$N$5","v":"18./19. Okt. 2025"},null,null,null,null,null,null,null,null,null,null,null,"9 nie nach 4 & 5",9,4,1,1,1,1,2,1,1,"x",1,13,5,18]
[16,"1-5",">",{"$f":"VLOOKUP(LEFT($B25,SEARCH(\"-\",$B25)-1),$O$2:$P$11,2,FALSE)","v":"Team 1"},"-",{"$f":"VLOOKUP(RIGHT($B25,LEN($B25)-SEARCH(\"-\",$B25)),$O$2:$P$11,2,FALSE)","v":"Team 5"},"Sa/So",null,"__.__","Uhr","__",null,null,null,null,null,10,2,3,null,1,1,2,null,2,1,"x",12,6,18]
[{"$f":"A25+1","v":17},"9-4",null,{"$f":"VLOOKUP(LEFT($B26,SEARCH(\"-\",$B26)-1),$O$2:$P$11,2,FALSE)","v":"Team 9"},"-",{"$f":"VLOOKUP(RIGHT($B26,LEN($B26)-SEARCH(\"-\",$B26)),$O$2:$P$11,2,FALSE)","v":"Team 4"},null,null,null,null,null,null,null,null,null,null,null,{"$f":"SUM(R16:R25)","v":14},{"$f":"SUM(S16:S25)","v":16},11,11,11,13,11,14,11,14]
[{"$f":"A26+1","v":18},"8-10",">",{"$f":"VLOOKUP(LEFT($B27,SEARCH(\"-\",$B27)-1),$O$2:$P$11,2,FALSE)","v":"Team 8"},"-",{"$f":"VLOOKUP(RIGHT($B27,LEN($B27)-SEARCH(\"-\",$B27)),$O$2:$P$11,2,FALSE)","v":"Team 10"},"Sa/So",null,"__.__","Uhr","__"]
[{"$f":"A27+1","v":19},"7-3",null,{"$f":"VLOOKUP(LEFT($B28,SEARCH(\"-\",$B28)-1),$O$2:$P$11,2,FALSE)","v":"Team 7"},"-",{"$f":"VLOOKUP(RIGHT($B28,LEN($B28)-SEARCH(\"-\",$B28)),$O$2:$P$11,2,FALSE)","v":"Team 3"}]
[{"$f":"A28+1","v":20},"6-2",">",{"$f":"VLOOKUP(LEFT($B29,SEARCH(\"-\",$B29)-1),$O$2:$P$11,2,FALSE)","v":"Team 6"},"-",{"$f":"VLOOKUP(RIGHT($B29,LEN($B29)-SEARCH(\"-\",$B29)),$O$2:$P$11,2,FALSE)","v":"Team 2"},"Sa/So",null,"__.__","Uhr","__"]
[]
["5.Spieltag",null,null,{"$f":"$N$6","v":"25./26. Okt. 2025"}]
[21,"3-8",">",{"$f":"VLOOKUP(LEFT($B32,SEARCH(\"-\",$B32)-1),$O$2:$P$11,2,FALSE)","v":"Team 3"},"-",{"$f":"VLOOKUP(RIGHT($B32,LEN($B32)-SEARCH(\"-\",$B32)),$O$2:$P$11,2,FALSE)","v":"Team 8"},"Sa/So",null,"__.__","Uhr","__"]
[{"$f":"A32+1","v":22},"5-2",null,{"$f":"VLOOKUP(LEFT($B33,SEARCH(\"-\",$B33)-1),$O$2:$P$11,2,FALSE)","v":"Team 5"},"-",{"$f":"VLOOKUP(RIGHT($B33,LEN($B33)-SEARCH(\"-\",$B33)),$O$2:$P$11,2,FALSE)","v":"Team 2"}]
[{"$f":"A33+1","v":23},"7-9",">",{"$f":"VLOOKUP(LEFT($B34,SEARCH(\"-\",$B34)-1),$O$2:$P$11,2,FALSE)","v":"Team 7"},"-",{"$f":"VLOOKUP(RIGHT($B34,LEN($B34)-SEARCH(\"-\",$B34)),$O$2:$P$11,2,FALSE)","v":"Team 9"},"Sa/So",null,"__.__","Uhr","__"]
[{"$f":"A34+1","v":24},"6-1",null,{"$f":"VLOOKUP(LEFT($B35,SEARCH(\"-\",$B35)-1),$O$2:$P$11,2,FALSE)","v":"Team 6"},"-",{"$f":"VLOOKUP(RIGHT($B35,LEN($B35)-SEARCH(\"-\",$B35)),$O$2:$P$11,2,FALSE)","v":"Team 1"}]
[{"$f":"A35+1","v":25},"10-4",">",{"$f":"VLOOKUP(LEFT($B36,SEARCH(\"-\",$B36)-1),$O$2:$P$11,2,FALSE)","v":"Team 10"},"-",{"$f":"VLOOKUP(RIGHT($B36,LEN($B36)-SEARCH(\"-\",$B36)),$O$2:$P$11,2,FALSE)","v":"Team 4"},"Sa/So",null,"__.__","Uhr","__"]
[]
["6.Spieltag",null,null,{"$f":"$N$7","v":"01./02. Nov. 2025 (Samstag Allerheiligen Spielverbot bis 18.00 Uhr)"}]
[26,"8-2",">",{"$f":"VLOOKUP(LEFT($B39,SEARCH(\"-\",$B39)-1),$O$2:$P$11,2,FALSE)","v":"Team 8"},"-",{"$f":"VLOOKUP(RIGHT($B39,LEN($B39)-SEARCH(\"-\",$B39)),$O$2:$P$11,2,FALSE)","v":"Team 2"},"So",null,"__.__","Uhr","__"]
[{"$f":"A39+1","v":27},"10-3",null,{"$f":"VLOOKUP(LEFT($B40,SEARCH(\"-\",$B40)-1),$O$2:$P$11,2,FALSE)","v":"Team 10"},"-",{"$f":"VLOOKUP(RIGHT($B40,LEN($B40)-SEARCH(\"-\",$B40)),$O$2:$P$11,2,FALSE)","v":"Team 3"}]
[{"$f":"A40+1","v":28},"4-6",">",{"$f":"VLOOKUP(LEFT($B41,SEARCH(\"-\",$B41)-1),$O$2:$P$11,2,FALSE)","v":"Team 4"},"-",{"$f":"VLOOKUP(RIGHT($B41,LEN($B41)-SEARCH(\"-\",$B41)),$O$2:$P$11,2,FALSE)","v":"Team 6"},"So",null,"__.__","Uhr","__"]
[{"$f":"A41+1","v":29},"5-9",null,{"$f":"VLOOKUP(LEFT($B42,SEARCH(\"-\",$B42)-1),$O$2:$P$11,2,FALSE)","v":"Team 5"},"-",{"$f":"VLOOKUP(RIGHT($B42,LEN($B42)-SEARCH(\"-\",$B42)),$O$2:$P$11,2,FALSE)","v":"Team 9"}]
[{"$f":"A42+1","v":30},"1-7",">",{"$f":"VLOOKUP(LEFT($B43,SEARCH(\"-\",$B43)-1),$O$2:$P$11,2,FALSE)","v":"Team 1"},"-",{"$f":"VLOOKUP(RIGHT($B43,LEN($B43)-SEARCH(\"-\",$B43)),$O$2:$P$11,2,FALSE)","v":"Team 7"},"So",null,"__.__","Uhr","__"]
[]
["7.Spieltag",null,null,{"$f":"$N$8","v":"15./16. Nov. 2025 (Sonntag Volkstrauertag Spielverbot bis 13.00 Uhr)"}]
[31,"2-10",">",{"$f":"VLOOKUP(LEFT($B46,SEARCH(\"-\",$B46)-1),$O$2:$P$11,2,FALSE)","v":"Team 2"},"-",{"$f":"VLOOKUP(RIGHT($B46,LEN($B46)-SEARCH(\"-\",$B46)),$O$2:$P$11,2,FALSE)","v":"Team 10"},"Sa/So",null,"__.__","Uhr","__"]
[{"$f":"A46+1","v":32},"6-7",null,{"$f":"VLOOKUP(LEFT($B47,SEARCH(\"-\",$B47)-1),$O$2:$P$11,2,FALSE)","v":"Team 6"},"-",{"$f":"VLOOKUP(RIGHT($B47,LEN($B47)-SEARCH(\"-\",$B47)),$O$2:$P$11,2,FALSE)","v":"Team 7"}]
[{"$f":"A47+1","v":33},"5-4",">",{"$f":"VLOOKUP(LEFT($B48,SEARCH(\"-\",$B48)-1),$O$2:$P$11,2,FALSE)","v":"Team 5"},"-",{"$f":"VLOOKUP(RIGHT($B48,LEN($B48)-SEARCH(\"-\",$B48)),$O$2:$P$11,2,FALSE)","v":"Team 4"},"Sa/So",null,"__.__","Uhr","__"]
[{"$f":"A48+1","v":34},"1-8",null,{"$f":"VLOOKUP(LEFT($B49,SEARCH(\"-\",$B49)-1),$O$2:$P$11,2,FALSE)","v":"Team 1"},"-",{"$f":"VLOOKUP(RIGHT($B49,LEN($B49)-SEARCH(\"-\",$B49)),$O$2:$P$11,2,FALSE)","v":"Team 8"}]
[{"$f":"A49+1","v":35},"9-3",">",{"$f":"VLOOKUP(LEFT($B50,SEARCH(\"-\",$B50)-1),$O$2:$P$11,2,FALSE)","v":"Team 9"},"-",{"$f":"VLOOKUP(RIGHT($B50,LEN($B50)-SEARCH(\"-\",$B50)),$O$2:$P$11,2,FALSE)","v":"Team 3"},"Sa/So",null,"__.__","Uhr","__"]
[]
["8.Spieltag",null,null,{"$f":"$N$9","v":"22. Nov. 2025 (Sonntag Totensonntag Spielverbot bis 18.00 Uhr)"}]
[36,"10-1",">",{"$f":"VLOOKUP(LEFT($B53,SEARCH(\"-\",$B53)-1),$O$2:$P$11,2,FALSE)","v":"Team 10"},"-",{"$f":"VLOOKUP(RIGHT($B53,LEN($B53)-SEARCH(\"-\",$B53)),$O$2:$P$11,2,FALSE)","v":"Team 1"},"Sa",null,"__.__","Uhr","__"]
[{"$f":"A53+1","v":37},"2-9",null,{"$f":"VLOOKUP(LEFT($B54,SEARCH(\"-\",$B54)-1),$O$2:$P$11,2,FALSE)","v":"Team 2"},"-",{"$f":"VLOOKUP(RIGHT($B54,LEN($B54)-SEARCH(\"-\",$B54)),$O$2:$P$11,2,FALSE)","v":"Team 9"}]
[{"$f":"A54+1","v":38},"6-8",">",{"$f":"VLOOKUP(LEFT($B55,SEARCH(\"-\",$B55)-1),$O$2:$P$11,2,FALSE)","v":"Team 6"},"-",{"$f":"VLOOKUP(RIGHT($B55,LEN($B55)-SEARCH(\"-\",$B55)),$O$2:$P$11,2,FALSE)","v":"Team 8"},"Sa",null,"__.__","Uhr","__"]
[{"$f":"A55+1","v":39},"4-7",null,{"$f":"VLOOKUP(LEFT($B56,SEARCH(\"-\",$B56)-1),$O$2:$P$11,2,FALSE)","v":"Team 4"},"-",{"$f":"VLOOKUP(RIGHT($B56,LEN($B56)-SEARCH(\"-\",$B56)),$O$2:$P$11,2,FALSE)","v":"Team 7"}]
[{"$f":"A56+1","v":40},"3-5",">",{"$f":"VLOOKUP(LEFT($B57,SEARCH(\"-\",$B57)-1),$O$2:$P$11,2,FALSE)","v":"Team 3"},"-",{"$f":"VLOOKUP(RIGHT($B57,LEN($B57)-SEARCH(\"-\",$B57)),$O$2:$P$11,2,FALSE)","v":"Team 5"},"Sa",null,"__.__","Uhr","__"]
[]
["9.Spieltag",null,null,{"$f":"$N$10","v":"06./07. Dez. 2025"}]
[41,"1-9",">",{"$f":"VLOOKUP(LEFT($B60,SEARCH(\"-\",$B60)-1),$O$2:$P$11,2,FALSE)","v":"Team 1"},"-",{"$f":"VLOOKUP(RIGHT($B60,LEN($B60)-SEARCH(\"-\",$B60)),$O$2:$P$11,2,FALSE)","v":"Team 9"},"Sa/So",null,"__.__","Uhr","__"]
[{"$f":"A60+1","v":42},"3-6",null,{"$f":"VLOOKUP(LEFT($B61,SEARCH(\"-\",$B61)-1),$O$2:$P$11,2,FALSE)","v":"Team 3"},"-",{"$f":"VLOOKUP(RIGHT($B61,LEN($B61)-SEARCH(\"-\",$B61)),$O$2:$P$11,2,FALSE)","v":"Team 6"}]
[{"$f":"A61+1","v":43},"7-2",">",{"$f":"VLOOKUP(LEFT($B62,SEARCH(\"-\",$B62)-1),$O$2:$P$11,2,FALSE)","v":"Team 7"},"-",{"$f":"VLOOKUP(RIGHT($B62,LEN($B62)-SEARCH(\"-\",$B62)),$O$2:$P$11,2,FALSE)","v":"Team 2"},"Sa/So",null,"__.__","Uhr","__"]
[{"$f":"A62+1","v":44},"8-4",null,{"$f":"VLOOKUP(LEFT($B63,SEARCH(\"-\",$B63)-1),$O$2:$P$11,2,FALSE)","v":"Team 8"},"-",{"$f":"VLOOKUP(RIGHT($B63,LEN($B63)-SEARCH(\"-\",$B63)),$O$2:$P$11,2,FALSE)","v":"Team 4"}]
[{"$f":"A63+1","v":45},"5-10",">",{"$f":"VLOOKUP(LEFT($B64,SEARCH(\"-\",$B64)-1),$O$2:$P$11,2,FALSE)","v":"Team 5"},"-",{"$f":"VLOOKUP(RIGHT($B64,LEN($B64)-SEARCH(\"-\",$B64)),$O$2:$P$11,2,FALSE)","v":"Team 10"},"Sa/So",null,"__.__","Uhr","__"]
[]
["####   Mit   >   gekennzeichnete Mannschaften haben Heimrecht   ####"]
[{"$f":"A1","v":"WVV-Spielplan: Liga x Frauen / Männer"},null,null,null,null,null,{"$f":"G1","v":"Saison 2025/26"},null,null,null,"Seite 2(2)"]
[null,null,null,null,null,null,null,null,null,null,"Halle"]
["10.Spieltag",null,null,{"$f":"$N$11","v":"20./21. Dez. 2025"}]
[46,"2-1",">",{"$f":"VLOOKUP(LEFT($B70,SEARCH(\"-\",$B70)-1),$O$2:$P$11,2,FALSE)","v":"Team 2"},"-",{"$f":"VLOOKUP(RIGHT($B70,LEN($B70)-SEARCH(\"-\",$B70)),$O$2:$P$11,2,FALSE)","v":"Team 1"},"Sa/So",null,"__.__","Uhr","__"]
[{"$f":"A70+1","v":47},"9-10",null,{"$f":"VLOOKUP(LEFT($B71,SEARCH(\"-\",$B71)-1),$O$2:$P$11,2,FALSE)","v":"Team 9"},"-",{"$f":"VLOOKUP(RIGHT($B71,LEN($B71)-SEARCH(\"-\",$B71)),$O$2:$P$11,2,FALSE)","v":"Team 10"}]
[{"$f":"A71+1","v":48},"4-3",">",{"$f":"VLOOKUP(LEFT($B72,SEARCH(\"-\",$B72)-1),$O$2:$P$11,2,FALSE)","v":"Team 4"},"-",{"$f":"VLOOKUP(RIGHT($B72,LEN($B72)-SEARCH(\"-\",$B72)),$O$2:$P$11,2,FALSE)","v":"Team 3"},"Sa/So",null,"__.__","Uhr","__"]
[{"$f":"A72+1","v":49},"6-5",null,{"$f":"VLOOKUP(LEFT($B73,SEARCH(\"-\",$B73)-1),$O$2:$P$11,2,FALSE)","v":"Team 6"},"-",{"$f":"VLOOKUP(RIGHT($B73,LEN($B73)-SEARCH(\"-\",$B73)),$O$2:$P$11,2,FALSE)","v":"Team 5"}]
[{"$f":"A73+1","v":50},"8-7",">",{"$f":"VLOOKUP(LEFT($B74,SEARCH(\"-\",$B74)-1),$O$2:$P$11,2,FALSE)","v":"Team 8"},"-",{"$f":"VLOOKUP(RIGHT($B74,LEN($B74)-SEARCH(\"-\",$B74)),$O$2:$P$11,2,FALSE)","v":"Team 7"},"Sa/So",null,"__.__","Uhr","__"]
[]
["11.Spieltag",null,null,{"$f":"$N$12","v":"10. Jan. 2026 (Sonntag Jugendspieltag)"}]
[51,"7-5",">",{"$f":"VLOOKUP(LEFT($B77,SEARCH(\"-\",$B77)-1),$O$2:$P$11,2,FALSE)","v":"Team 7"},"-",{"$f":"VLOOKUP(RIGHT($B77,LEN($B77)-SEARCH(\"-\",$B77)),$O$2:$P$11,2,FALSE)","v":"Team 5"},"Sa",null,"__.__","Uhr","__"]
[{"$f":"A77+1","v":52},"3-1",null,{"$f":"VLOOKUP(LEFT($B78,SEARCH(\"-\",$B78)-1),$O$2:$P$11,2,FALSE)","v":"Team 3"},"-",{"$f":"VLOOKUP(RIGHT($B78,LEN($B78)-SEARCH(\"-\",$B78)),$O$2:$P$11,2,FALSE)","v":"Team 1"}]
[{"$f":"A78+1","v":53},"10-6",">",{"$f":"VLOOKUP(LEFT($B79,SEARCH(\"-\",$B79)-1),$O$2:$P$11,2,FALSE)","v":"Team 10"},"-",{"$f":"VLOOKUP(RIGHT($B79,LEN($B79)-SEARCH(\"-\",$B79)),$O$2:$P$11,2,FALSE)","v":"Team 6"},"Sa",null,"__.__","Uhr","__"]
[{"$f":"A79+1","v":54},"4-2",null,{"$f":"VLOOKUP(LEFT($B80,SEARCH(\"-\",$B80)-1),$O$2:$P$11,2,FALSE)","v":"Team 4"},"-",{"$f":"VLOOKUP(RIGHT($B80,LEN($B80)-SEARCH(\"-\",$B80)),$O$2:$P$11,2,FALSE)","v":"Team 2"}]
[{"$f":"A80+1","v":55},"9-8",">",{"$f":"VLOOKUP(LEFT($B81,SEARCH(\"-\",$B81)-1),$O$2:$P$11,2,FALSE)","v":"Team 9"},"-",{"$f":"VLOOKUP(RIGHT($B81,LEN($B81)-SEARCH(\"-\",$B81)),$O$2:$P$11,2,FALSE)","v":"Team 8"},"Sa",null,"__.__","Uhr","__"]
[]
["12.Spieltag",null,null,{"$f":"$N$13","v":"17./18. Jan. 2026"}]
[56,"3-2",">",{"$f":"VLOOKUP(LEFT($B84,SEARCH(\"-\",$B84)-1),$O$2:$P$11,2,FALSE)","v":"Team 3"},"-",{"$f":"VLOOKUP(RIGHT($B84,LEN($B84)-SEARCH(\"-\",$B84)),$O$2:$P$11,2,FALSE)","v":"Team 2"},"Sa/So",null,"__.__","Uhr","__"]
[{"$f":"A84+1","v":57},"5-8",null,{"$f":"VLOOKUP(LEFT($B85,SEARCH(\"-\",$B85)-1),$O$2:$P$11,2,FALSE)","v":"Team 5"},"-",{"$f":"VLOOKUP(RIGHT($B85,LEN($B85)-SEARCH(\"-\",$B85)),$O$2:$P$11,2,FALSE)","v":"Team 8"}]
[{"$f":"A85+1","v":58},"6-9",">",{"$f":"VLOOKUP(LEFT($B86,SEARCH(\"-\",$B86)-1),$O$2:$P$11,2,FALSE)","v":"Team 6"},"-",{"$f":"VLOOKUP(RIGHT($B86,LEN($B86)-SEARCH(\"-\",$B86)),$O$2:$P$11,2,FALSE)","v":"Team 9"},"Sa/So",null,"__.__","Uhr","__"]
[{"$f":"A86+1","v":59},"10-7",null,{"$f":"VLOOKUP(LEFT($B87,SEARCH(\"-\",$B87)-1),$O$2:$P$11,2,FALSE)","v":"Team 10"},"-",{"$f":"VLOOKUP(RIGHT($B87,LEN($B87)-SEARCH(\"-\",$B87)),$O$2:$P$11,2,FALSE)","v":"Team 7"}]
[{"$f":"A87+1","v":60},"1-4",">",{"$f":"VLOOKUP(LEFT($B88,SEARCH(\"-\",$B88)-1),$O$2:$P$11,2,FALSE)","v":"Team 1"},"-",{"$f":"VLOOKUP(RIGHT($B88,LEN($B88)-SEARCH(\"-\",$B88)),$O$2:$P$11,2,FALSE)","v":"Team 4"},"Sa/So",null,"__.__","Uhr","__"]
[]
["13.Spieltag",null,null,{"$f":"$N$14","v":"24. Jan. 2026 (Sonntag Jugendspieltag)"}]
[61,"5-1",">",{"$f":"VLOOKUP(LEFT($B91,SEARCH(\"-\",$B91)-1),$O$2:$P$11,2,FALSE)","v":"Team 5"},"-",{"$f":"VLOOKUP(RIGHT($B91,LEN($B91)-SEARCH(\"-\",$B91)),$O$2:$P$11,2,FALSE)","v":"Team 1"},"Sa",null,"__.__","Uhr","__"]
[{"$f":"A91+1","v":62},"4-9",null,{"$f":"VLOOKUP(LEFT($B92,SEARCH(\"-\",$B92)-1),$O$2:$P$11,2,FALSE)","v":"Team 4"},"-",{"$f":"VLOOKUP(RIGHT($B92,LEN($B92)-SEARCH(\"-\",$B92)),$O$2:$P$11,2,FALSE)","v":"Team 9"}]
[{"$f":"A92+1","v":63},"10-8",">",{"$f":"VLOOKUP(LEFT($B93,SEARCH(\"-\",$B93)-1),$O$2:$P$11,2,FALSE)","v":"Team 10"},"-",{"$f":"VLOOKUP(RIGHT($B93,LEN($B93)-SEARCH(\"-\",$B93)),$O$2:$P$11,2,FALSE)","v":"Team 8"},"Sa",null,"__.__","Uhr","__"]
[{"$f":"A93+1","v":64},"3-7",null,{"$f":"VLOOKUP(LEFT($B94,SEARCH(\"-\",$B94)-1),$O$2:$P$11,2,FALSE)","v":"Team 3"},"-",{"$f":"VLOOKUP(RIGHT($B94,LEN($B94)-SEARCH(\"-\",$B94)),$O$2:$P$11,2,FALSE)","v":"Team 7"}]
[{"$f":"A94+1","v":65},"2-6",">",{"$f":"VLOOKUP(LEFT($B95,SEARCH(\"-\",$B95)-1),$O$2:$P$11,2,FALSE)","v":"Team 2"},"-",{"$f":"VLOOKUP(RIGHT($B95,LEN($B95)-SEARCH(\"-\",$B95)),$O$2:$P$11,2,FALSE)","v":"Team 6"},"Sa",null,"__.__","Uhr","__"]
[]
["14.Spieltag",null,null,{"$f":"$N$15","v":"31. Jan./01. Feb. 2026 (Sonntag 1. Runde Bezirkspokal bis OL)"}]
[66,"8-3",">",{"$f":"VLOOKUP(LEFT($B98,SEARCH(\"-\",$B98)-1),$O$2:$P$11,2,FALSE)","v":"Team 8"},"-",{"$f":"VLOOKUP(RIGHT($B98,LEN($B98)-SEARCH(\"-\",$B98)),$O$2:$P$11,2,FALSE)","v":"Team 3"},"Sa/So",null,"__.__","Uhr","__"]
[{"$f":"A98+1","v":67},"2-5",null,{"$f":"VLOOKUP(LEFT($B99,SEARCH(\"-\",$B99)-1),$O$2:$P$11,2,FALSE)","v":"Team 2"},"-",{"$f":"VLOOKUP(RIGHT($B99,LEN($B99)-SEARCH(\"-\",$B99)),$O$2:$P$11,2,FALSE)","v":"Team 5"}]
[{"$f":"A99+1","v":68},"9-7",">",{"$f":"VLOOKUP(LEFT($B100,SEARCH(\"-\",$B100)-1),$O$2:$P$11,2,FALSE)","v":"Team 9"},"-",{"$f":"VLOOKUP(RIGHT($B100,LEN($B100)-SEARCH(\"-\",$B100)),$O$2:$P$11,2,FALSE)","v":"Team 7"},"Sa/So",null,"__.__","Uhr","__"]
[{"$f":"A100+1","v":69},"1-6",null,{"$f":"VLOOKUP(LEFT($B101,SEARCH(\"-\",$B101)-1),$O$2:$P$11,2,FALSE)","v":"Team 1"},"-",{"$f":"VLOOKUP(RIGHT($B101,LEN($B101)-SEARCH(\"-\",$B101)),$O$2:$P$11,2,FALSE)","v":"Team 6"}]
[{"$f":"A101+1","v":70},"4-10",">",{"$f":"VLOOKUP(LEFT($B102,SEARCH(\"-\",$B102)-1),$O$2:$P$11,2,FALSE)","v":"Team 4"},"-",{"$f":"VLOOKUP(RIGHT($B102,LEN($B102)-SEARCH(\"-\",$B102)),$O$2:$P$11,2,FALSE)","v":"Team 10"},"Sa/So",null,"__.__","Uhr","__"]
[]
["15.Spieltag",null,null,{"$f":"$N$16","v":"14./15. Feb. 2026 (Sonntag Karneval)"}]
[71,"2-8",">",{"$f":"VLOOKUP(LEFT($B105,SEARCH(\"-\",$B105)-1),$O$2:$P$11,2,FALSE)","v":"Team 2"},"-",{"$f":"VLOOKUP(RIGHT($B105,LEN($B105)-SEARCH(\"-\",$B105)),$O$2:$P$11,2,FALSE)","v":"Team 8"},"Sa/So",null,"__.__","Uhr","__"]
[{"$f":"A105+1","v":72},"3-10",null,{"$f":"VLOOKUP(LEFT($B106,SEARCH(\"-\",$B106)-1),$O$2:$P$11,2,FALSE)","v":"Team 3"},"-",{"$f":"VLOOKUP(RIGHT($B106,LEN($B106)-SEARCH(\"-\",$B106)),$O$2:$P$11,2,FALSE)","v":"Team 10"}]
[{"$f":"A106+1","v":73},"6-4",">",{"$f":"VLOOKUP(LEFT($B107,SEARCH(\"-\",$B107)-1),$O$2:$P$11,2,FALSE)","v":"Team 6"},"-",{"$f":"VLOOKUP(RIGHT($B107,LEN($B107)-SEARCH(\"-\",$B107)),$O$2:$P$11,2,FALSE)","v":"Team 4"},"Sa/So",null,"__.__","Uhr","__"]
[{"$f":"A107+1","v":74},"9-5",null,{"$f":"VLOOKUP(LEFT($B108,SEARCH(\"-\",$B108)-1),$O$2:$P$11,2,FALSE)","v":"Team 9"},"-",{"$f":"VLOOKUP(RIGHT($B108,LEN($B108)-SEARCH(\"-\",$B108)),$O$2:$P$11,2,FALSE)","v":"Team 5"}]
[{"$f":"A108+1","v":75},"7-1",">",{"$f":"VLOOKUP(LEFT($B109,SEARCH(\"-\",$B109)-1),$O$2:$P$11,2,FALSE)","v":"Team 7"},"-",{"$f":"VLOOKUP(RIGHT($B109,LEN($B109)-SEARCH(\"-\",$B109)),$O$2:$P$11,2,FALSE)","v":"Team 1"},"Sa/So",null,"__.__","Uhr","__"]
[]
["16.Spieltag",null,null,{"$f":"$N$17","v":"21./22. Feb. 2026 (Sonntag 2. Runde Bezirkspokal)"}]
[76,"10-2",">",{"$f":"VLOOKUP(LEFT($B112,SEARCH(\"-\",$B112)-1),$O$2:$P$11,2,FALSE)","v":"Team 10"},"-",{"$f":"VLOOKUP(RIGHT($B112,LEN($B112)-SEARCH(\"-\",$B112)),$O$2:$P$11,2,FALSE)","v":"Team 2"},"Sa/So",null,"__.__","Uhr","__"]
[{"$f":"A112+1","v":77},"7-6",null,{"$f":"VLOOKUP(LEFT($B113,SEARCH(\"-\",$B113)-1),$O$2:$P$11,2,FALSE)","v":"Team 7"},"-",{"$f":"VLOOKUP(RIGHT($B113,LEN($B113)-SEARCH(\"-\",$B113)),$O$2:$P$11,2,FALSE)","v":"Team 6"}]
[{"$f":"A113+1","v":78},"4-5",">",{"$f":"VLOOKUP(LEFT($B114,SEARCH(\"-\",$B114)-1),$O$2:$P$11,2,FALSE)","v":"Team 4"},"-",{"$f":"VLOOKUP(RIGHT($B114,LEN($B114)-SEARCH(\"-\",$B114)),$O$2:$P$11,2,FALSE)","v":"Team 5"},"Sa/So",null,"__.__","Uhr","__"]
[{"$f":"A114+1","v":79},"8-1",null,{"$f":"VLOOKUP(LEFT($B115,SEARCH(\"-\",$B115)-1),$O$2:$P$11,2,FALSE)","v":"Team 8"},"-",{"$f":"VLOOKUP(RIGHT($B115,LEN($B115)-SEARCH(\"-\",$B115)),$O$2:$P$11,2,FALSE)","v":"Team 1"}]
[{"$f":"A115+1","v":80},"3-9",">",{"$f":"VLOOKUP(LEFT($B116,SEARCH(\"-\",$B116)-1),$O$2:$P$11,2,FALSE)","v":"Team 3"},"-",{"$f":"VLOOKUP(RIGHT($B116,LEN($B116)-SEARCH(\"-\",$B116)),$O$2:$P$11,2,FALSE)","v":"Team 9"},"Sa/So",null,"__.__","Uhr","__"]
[]
["17.Spieltag",null,null,{"$f":"$N$18","v":"07./08. Mär. 2026"}]
[81,"1-10",">",{"$f":"VLOOKUP(LEFT($B119,SEARCH(\"-\",$B119)-1),$O$2:$P$11,2,FALSE)","v":"Team 1"},"-",{"$f":"VLOOKUP(RIGHT($B119,LEN($B119)-SEARCH(\"-\",$B119)),$O$2:$P$11,2,FALSE)","v":"Team 10"},"Sa/So",null,"__.__","Uhr","__"]
[{"$f":"A119+1","v":82},"9-2",null,{"$f":"VLOOKUP(LEFT($B120,SEARCH(\"-\",$B120)-1),$O$2:$P$11,2,FALSE)","v":"Team 9"},"-",{"$f":"VLOOKUP(RIGHT($B120,LEN($B120)-SEARCH(\"-\",$B120)),$O$2:$P$11,2,FALSE)","v":"Team 2"}]
[{"$f":"A120+1","v":83},"8-6",">",{"$f":"VLOOKUP(LEFT($B121,SEARCH(\"-\",$B121)-1),$O$2:$P$11,2,FALSE)","v":"Team 8"},"-",{"$f":"VLOOKUP(RIGHT($B121,LEN($B121)-SEARCH(\"-\",$B121)),$O$2:$P$11,2,FALSE)","v":"Team 6"},"Sa/So",null,"__.__","Uhr","__"]
[{"$f":"A121+1","v":84},"7-4",null,{"$f":"VLOOKUP(LEFT($B122,SEARCH(\"-\",$B122)-1),$O$2:$P$11,2,FALSE)","v":"Team 7"},"-",{"$f":"VLOOKUP(RIGHT($B122,LEN($B122)-SEARCH(\"-\",$B122)),$O$2:$P$11,2,FALSE)","v":"Team 4"}]
[{"$f":"A122+1","v":85},"5-3",">",{"$f":"VLOOKUP(LEFT($B123,SEARCH(\"-\",$B123)-1),$O$2:$P$11,2,FALSE)","v":"Team 5"},"-",{"$f":"VLOOKUP(RIGHT($B123,LEN($B123)-SEARCH(\"-\",$B123)),$O$2:$P$11,2,FALSE)","v":"Team 3"},"Sa/So",null,"__.__","Uhr","__"]
[]
["18.Spieltag",null,null,{"$f":"$N$19","v":"21./22. Mär. 2026"}]
[86,"9-1",">",{"$f":"VLOOKUP(LEFT($B126,SEARCH(\"-\",$B126)-1),$O$2:$P$11,2,FALSE)","v":"Team 9"},"-",{"$f":"VLOOKUP(RIGHT($B126,LEN($B126)-SEARCH(\"-\",$B126)),$O$2:$P$11,2,FALSE)","v":"Team 1"},"Sa/So",null,"__.__","Uhr","__"]
[{"$f":"A126+1","v":87},"6-3",null,{"$f":"VLOOKUP(LEFT($B127,SEARCH(\"-\",$B127)-1),$O$2:$P$11,2,FALSE)","v":"Team 6"},"-",{"$f":"VLOOKUP(RIGHT($B127,LEN($B127)-SEARCH(\"-\",$B127)),$O$2:$P$11,2,FALSE)","v":"Team 3"}]
[{"$f":"A127+1","v":88},"2-7",">",{"$f":"VLOOKUP(LEFT($B128,SEARCH(\"-\",$B128)-1),$O$2:$P$11,2,FALSE)","v":"Team 2"},"-",{"$f":"VLOOKUP(RIGHT($B128,LEN($B128)-SEARCH(\"-\",$B128)),$O$2:$P$11,2,FALSE)","v":"Team 7"},"Sa/So",null,"__.__","Uhr","__"]
[{"$f":"A128+1","v":89},"4-8",null,{"$f":"VLOOKUP(LEFT($B129,SEARCH(\"-\",$B129)-1),$O$2:$P$11,2,FALSE)","v":"Team 4"},"-",{"$f":"VLOOKUP(RIGHT($B129,LEN($B129)-SEARCH(\"-\",$B129)),$O$2:$P$11,2,FALSE)","v":"Team 8"}]
[{"$f":"A129+1","v":90},"10-5",">",{"$f":"VLOOKUP(LEFT($B130,SEARCH(\"-\",$B130)-1),$O$2:$P$11,2,FALSE)","v":"Team 10"},"-",{"$f":"VLOOKUP(RIGHT($B130,LEN($B130)-SEARCH(\"-\",$B130)),$O$2:$P$11,2,FALSE)","v":"Team 5"},"Sa/So",null,"__.__","Uhr","__"]
[]
["Relegation: 01. – 03. Mai 2026"]
[]
["####   Mit   >   gekennzeichnete Mannschaften haben Heimrecht   ####"]

{"sheet":"WVV 8 auf 14 Einzelspiele","index":5,"n_rows":93,"n_cols":16,"rows_kept":93,"cut":false,"hidden":false,"merged":[]}
[{"$f":"\"WVV-Spielplan: \"&N1","v":"WVV-Spielplan: Liga x Frauen / Männer"},null,null,null,null,null,"Saison 2025/26",null,null,null,"Seite 1(2)",null,null,"Liga x Frauen / Männer"]
[null,null,null,null,null,null,null,null,null,null,"Halle",null,"1.","20./21. Sept. 2025 (Sonntag WVV-Pokal)","1","Team 1"]
["1.Spieltag",null,null,{"$f":"$N$2","v":"20./21. Sept. 2025 (Sonntag WVV-Pokal)"},null,null,null,null,null,null,null,null,"2.","04./05. Okt. 2025","2","Team 2"]
[1,"1-7",">",{"$f":"VLOOKUP(LEFT($B4,SEARCH(\"-\",$B4)-1),$O$2:$P$9,2,FALSE)","v":"Team 1"},"-",{"$f":"VLOOKUP(RIGHT($B4,LEN($B4)-SEARCH(\"-\",$B4)),$O$2:$P$9,2,FALSE)","v":"Team 7"},"Sa/So",null,"__.__","Uhr","__",null,"3.","11./12. Okt. 2025 (Sonntag WVV-Pokalfinale)","3","Team 3"]
[{"$f":"A4+1","v":2},"3-4",">",{"$f":"VLOOKUP(LEFT($B5,SEARCH(\"-\",$B5)-1),$O$2:$P$9,2,FALSE)","v":"Team 3"},"-",{"$f":"VLOOKUP(RIGHT($B5,LEN($B5)-SEARCH(\"-\",$B5)),$O$2:$P$9,2,FALSE)","v":"Team 4"},"Sa/So",null,"__.__","Uhr","__",null,"4.","25./26. Okt. 2025","4","Team 4"]
[{"$f":"A5+1","v":3},"5-2",">",{"$f":"VLOOKUP(LEFT($B6,SEARCH(\"-\",$B6)-1),$O$2:$P$9,2,FALSE)","v":"Team 5"},"-",{"$f":"VLOOKUP(RIGHT($B6,LEN($B6)-SEARCH(\"-\",$B6)),$O$2:$P$9,2,FALSE)","v":"Team 2"},"Sa/So",null,"__.__","Uhr","__",null,"5.","01./02. Nov. 2025 (Samstag Allerheiligen Spielverbot bis 18.00 Uhr)","5","Team 5"]
[{"$f":"A6+1","v":4},"8-6",">",{"$f":"VLOOKUP(LEFT($B7,SEARCH(\"-\",$B7)-1),$O$2:$P$9,2,FALSE)","v":"Team 8"},"-",{"$f":"VLOOKUP(RIGHT($B7,LEN($B7)-SEARCH(\"-\",$B7)),$O$2:$P$9,2,FALSE)","v":"Team 6"},"Sa/So",null,"__.__","Uhr","__",null,"6.","15./16. Nov. 2025 (Sonntag Volkstrauertag Spielverbot bis 13.00 Uhr)","6","Team 6"]
[null,null,null,null,null,null,null,null,null,null,null,null,"7.","06./07. Dez. 2025","7","Team 7"]
["2.Spieltag",null,null,{"$f":"$N$3","v":"04./05. Okt. 2025"},null,null,null,null,null,null,null,null,"8.","20./21. Dez. 2025","8","Team 8"]
[5,"2-3",">",{"$f":"VLOOKUP(LEFT($B10,SEARCH(\"-\",$B10)-1),$O$2:$P$9,2,FALSE)","v":"Team 2"},"-",{"$f":"VLOOKUP(RIGHT($B10,LEN($B10)-SEARCH(\"-\",$B10)),$O$2:$P$9,2,FALSE)","v":"Team 3"},"Sa/So",null,"__.__","Uhr","__",null,"9.","17./18. Jan. 2026"]
[6,"4-8",">",{"$f":"VLOOKUP(LEFT($B11,SEARCH(\"-\",$B11)-1),$O$2:$P$9,2,FALSE)","v":"Team 4"},"-",{"$f":"VLOOKUP(RIGHT($B11,LEN($B11)-SEARCH(\"-\",$B11)),$O$2:$P$9,2,FALSE)","v":"Team 8"},"Sa/So",null,"__.__","Uhr","__",null,"10.","24. Jan. 2026 (Sonntag Jugendspieltag)"]
[7,"6-1",">",{"$f":"VLOOKUP(LEFT($B12,SEARCH(\"-\",$B12)-1),$O$2:$P$9,2,FALSE)","v":"Team 6"},"-",{"$f":"VLOOKUP(RIGHT($B12,LEN($B12)-SEARCH(\"-\",$B12)),$O$2:$P$9,2,FALSE)","v":"Team 1"},"Sa/So",null,"__.__","Uhr","__",null,"11.","31. Jan./01. Feb. 2026 (Sonntag 1. Runde Bezirkspokal bis OL)"]
[8,"7-5",">",{"$f":"VLOOKUP(LEFT($B13,SEARCH(\"-\",$B13)-1),$O$2:$P$9,2,FALSE)","v":"Team 7"},"-",{"$f":"VLOOKUP(RIGHT($B13,LEN($B13)-SEARCH(\"-\",$B13)),$O$2:$P$9,2,FALSE)","v":"Team 5"},"Sa/So",null,"__.__","Uhr","__",null,"12.","21./22. Feb. 2026 (Sonntag 2. Runde Bezirkspokal)"]
[null,null,null,null,null,null,null,null,null,null,null,null,"13.","07./08. Mär. 2026"]
["3.Spieltag",null,null,{"$f":"$N$4","v":"11./12. Okt. 2025 (Sonntag WVV-Pokalfinale)"},null,null,null,null,null,null,null,null,"14.","21./22. Mär. 2026"]
[9,"1-5",">",{"$f":"VLOOKUP(LEFT($B16,SEARCH(\"-\",$B16)-1),$O$2:$P$9,2,FALSE)","v":"Team 1"},"-",{"$f":"VLOOKUP(RIGHT($B16,LEN($B16)-SEARCH(\"-\",$B16)),$O$2:$P$9,2,FALSE)","v":"Team 5"},"Sa/So",null,"__.__","Uhr","__"]
[10,"3-7",">",{"$f":"VLOOKUP(LEFT($B17,SEARCH(\"-\",$B17)-1),$O$2:$P$9,2,FALSE)","v":"Team 3"},"-",{"$f":"VLOOKUP(RIGHT($B17,LEN($B17)-SEARCH(\"-\",$B17)),$O$2:$P$9,2,FALSE)","v":"Team 7"},"Sa/So",null,"__.__","Uhr","__"]
[11,"6-4",">",{"$f":"VLOOKUP(LEFT($B18,SEARCH(\"-\",$B18)-1),$O$2:$P$9,2,FALSE)","v":"Team 6"},"-",{"$f":"VLOOKUP(RIGHT($B18,LEN($B18)-SEARCH(\"-\",$B18)),$O$2:$P$9,2,FALSE)","v":"Team 4"},"Sa/So",null,"__.__","Uhr","__"]
[12,"8-2",">",{"$f":"VLOOKUP(LEFT($B19,SEARCH(\"-\",$B19)-1),$O$2:$P$9,2,FALSE)","v":"Team 8"},"-",{"$f":"VLOOKUP(RIGHT($B19,LEN($B19)-SEARCH(\"-\",$B19)),$O$2:$P$9,2,FALSE)","v":"Team 2"},"Sa/So",null,"__.__","Uhr","__"]
[]
["4.Spieltag",null,null,{"$f":"$N$5","v":"25./26. Okt. 2025"}]
[13,"2-6",">",{"$f":"VLOOKUP(LEFT($B22,SEARCH(\"-\",$B22)-1),$O$2:$P$9,2,FALSE)","v":"Team 2"},"-",{"$f":"VLOOKUP(RIGHT($B22,LEN($B22)-SEARCH(\"-\",$B22)),$O$2:$P$9,2,FALSE)","v":"Team 6"},"Sa/So",null,"__.__","Uhr","__"]
[14,"4-1",">",{"$f":"VLOOKUP(LEFT($B23,SEARCH(\"-\",$B23)-1),$O$2:$P$9,2,FALSE)","v":"Team 4"},"-",{"$f":"VLOOKUP(RIGHT($B23,LEN($B23)-SEARCH(\"-\",$B23)),$O$2:$P$9,2,FALSE)","v":"Team 1"},"Sa/So",null,"__.__","Uhr","__"]
[15,"5-3",">",{"$f":"VLOOKUP(LEFT($B24,SEARCH(\"-\",$B24)-1),$O$2:$P$9,2,FALSE)","v":"Team 5"},"-",{"$f":"VLOOKUP(RIGHT($B24,LEN($B24)-SEARCH(\"-\",$B24)),$O$2:$P$9,2,FALSE)","v":"Team 3"},"Sa/So",null,"__.__","Uhr","__"]
[16,"7-8",">",{"$f":"VLOOKUP(LEFT($B25,SEARCH(\"-\",$B25)-1),$O$2:$P$9,2,FALSE)","v":"Team 7"},"-",{"$f":"VLOOKUP(RIGHT($B25,LEN($B25)-SEARCH(\"-\",$B25)),$O$2:$P$9,2,FALSE)","v":"Team 8"},"Sa/So",null,"__.__","Uhr","__"]
[]
["5.Spieltag",null,null,{"$f":"$N$6","v":"01./02. Nov. 2025 (Samstag Allerheiligen Spielverbot bis 18.00 Uhr)"}]
[17,"1-3",">",{"$f":"VLOOKUP(LEFT($B28,SEARCH(\"-\",$B28)-1),$O$2:$P$9,2,FALSE)","v":"Team 1"},"-",{"$f":"VLOOKUP(RIGHT($B28,LEN($B28)-SEARCH(\"-\",$B28)),$O$2:$P$9,2,FALSE)","v":"Team 3"},"So",null,"__.__","Uhr","__"]
[18,"4-2",">",{"$f":"VLOOKUP(LEFT($B29,SEARCH(\"-\",$B29)-1),$O$2:$P$9,2,FALSE)","v":"Team 4"},"-",{"$f":"VLOOKUP(RIGHT($B29,LEN($B29)-SEARCH(\"-\",$B29)),$O$2:$P$9,2,FALSE)","v":"Team 2"},"So",null,"__.__","Uhr","__"]
[19,"6-7",">",{"$f":"VLOOKUP(LEFT($B30,SEARCH(\"-\",$B30)-1),$O$2:$P$9,2,FALSE)","v":"Team 6"},"-",{"$f":"VLOOKUP(RIGHT($B30,LEN($B30)-SEARCH(\"-\",$B30)),$O$2:$P$9,2,FALSE)","v":"Team 7"},"So",null,"__.__","Uhr","__"]
[20,"8-5",">",{"$f":"VLOOKUP(LEFT($B31,SEARCH(\"-\",$B31)-1),$O$2:$P$9,2,FALSE)","v":"Team 8"},"-",{"$f":"VLOOKUP(RIGHT($B31,LEN($B31)-SEARCH(\"-\",$B31)),$O$2:$P$9,2,FALSE)","v":"Team 5"},"So",null,"__.__","Uhr","__"]
[]
["6.Spieltag",null,null,{"$f":"$N$7","v":"15./16. Nov. 2025 (Sonntag Volkstrauertag Spielverbot bis 13.00 Uhr)"}]
[21,"1-2",">",{"$f":"VLOOKUP(LEFT($B34,SEARCH(\"-\",$B34)-1),$O$2:$P$9,2,FALSE)","v":"Team 1"},"-",{"$f":"VLOOKUP(RIGHT($B34,LEN($B34)-SEARCH(\"-\",$B34)),$O$2:$P$9,2,FALSE)","v":"Team 2"},"Sa/So",null,"__.__","Uhr","__"]
[22,"3-8",">",{"$f":"VLOOKUP(LEFT($B35,SEARCH(\"-\",$B35)-1),$O$2:$P$9,2,FALSE)","v":"Team 3"},"-",{"$f":"VLOOKUP(RIGHT($B35,LEN($B35)-SEARCH(\"-\",$B35)),$O$2:$P$9,2,FALSE)","v":"Team 8"},"Sa/So",null,"__.__","Uhr","__"]
[23,"5-6",">",{"$f":"VLOOKUP(LEFT($B36,SEARCH(\"-\",$B36)-1),$O$2:$P$9,2,FALSE)","v":"Team 5"},"-",{"$f":"VLOOKUP(RIGHT($B36,LEN($B36)-SEARCH(\"-\",$B36)),$O$2:$P$9,2,FALSE)","v":"Team 6"},"Sa/So",null,"__.__","Uhr","__"]
[24,"7-4",">",{"$f":"VLOOKUP(LEFT($B37,SEARCH(\"-\",$B37)-1),$O$2:$P$9,2,FALSE)","v":"Team 7"},"-",{"$f":"VLOOKUP(RIGHT($B37,LEN($B37)-SEARCH(\"-\",$B37)),$O$2:$P$9,2,FALSE)","v":"Team 4"},"Sa/So",null,"__.__","Uhr","__"]
[]
["7.Spieltag",null,null,{"$f":"$N$8","v":"06./07. Dez. 2025"}]
[25,"2-7",">",{"$f":"VLOOKUP(LEFT($B40,SEARCH(\"-\",$B40)-1),$O$2:$P$9,2,FALSE)","v":"Team 2"},"-",{"$f":"VLOOKUP(RIGHT($B40,LEN($B40)-SEARCH(\"-\",$B40)),$O$2:$P$9,2,FALSE)","v":"Team 7"},"Sa/So",null,"__.__","Uhr","__"]
[26,"4-5",">",{"$f":"VLOOKUP(LEFT($B41,SEARCH(\"-\",$B41)-1),$O$2:$P$9,2,FALSE)","v":"Team 4"},"-",{"$f":"VLOOKUP(RIGHT($B41,LEN($B41)-SEARCH(\"-\",$B41)),$O$2:$P$9,2,FALSE)","v":"Team 5"},"Sa/So",null,"__.__","Uhr","__"]
[27,"6-3",">",{"$f":"VLOOKUP(LEFT($B42,SEARCH(\"-\",$B42)-1),$O$2:$P$9,2,FALSE)","v":"Team 6"},"-",{"$f":"VLOOKUP(RIGHT($B42,LEN($B42)-SEARCH(\"-\",$B42)),$O$2:$P$9,2,FALSE)","v":"Team 3"},"Sa/So",null,"__.__","Uhr","__"]
[28,"8-1",">",{"$f":"VLOOKUP(LEFT($B43,SEARCH(\"-\",$B43)-1),$O$2:$P$9,2,FALSE)","v":"Team 8"},"-",{"$f":"VLOOKUP(RIGHT($B43,LEN($B43)-SEARCH(\"-\",$B43)),$O$2:$P$9,2,FALSE)","v":"Team 1"},"Sa/So",null,"__.__","Uhr","__"]
[]
["####   Mit   >   gekennzeichnete Mannschaften haben Heimrecht   ####"]
[]
[{"$f":"A1","v":"WVV-Spielplan: Liga x Frauen / Männer"},null,null,null,null,null,{"$f":"G1","v":"Saison 2025/26"},null,null,null,"Seite 2(2)"]
[null,null,null,null,null,null,null,null,null,null,"Halle"]
["8.Spieltag",null,null,{"$f":"$N$9","v":"20./21. Dez. 2025"}]
[29,"7-1",">",{"$f":"VLOOKUP(LEFT($B50,SEARCH(\"-\",$B50)-1),$O$2:$P$9,2,FALSE)","v":"Team 7"},"-",{"$f":"VLOOKUP(RIGHT($B50,LEN($B50)-SEARCH(\"-\",$B50)),$O$2:$P$9,2,FALSE)","v":"Team 1"},"Sa/So",null,"__.__","Uhr","__"]
[30,"4-3",">",{"$f":"VLOOKUP(LEFT($B51,SEARCH(\"-\",$B51)-1),$O$2:$P$9,2,FALSE)","v":"Team 4"},"-",{"$f":"VLOOKUP(RIGHT($B51,LEN($B51)-SEARCH(\"-\",$B51)),$O$2:$P$9,2,FALSE)","v":"Team 3"},"Sa/So",null,"__.__","Uhr","__"]
[31,"2-5",">",{"$f":"VLOOKUP(LEFT($B52,SEARCH(\"-\",$B52)-1),$O$2:$P$9,2,FALSE)","v":"Team 2"},"-",{"$f":"VLOOKUP(RIGHT($B52,LEN($B52)-SEARCH(\"-\",$B52)),$O$2:$P$9,2,FALSE)","v":"Team 5"},"Sa/So",null,"__.__","Uhr","__"]
[32,"6-8",">",{"$f":"VLOOKUP(LEFT($B53,SEARCH(\"-\",$B53)-1),$O$2:$P$9,2,FALSE)","v":"Team 6"},"-",{"$f":"VLOOKUP(RIGHT($B53,LEN($B53)-SEARCH(\"-\",$B53)),$O$2:$P$9,2,FALSE)","v":"Team 8"},"Sa/So",null,"__.__","Uhr","__"]
[]
["9.Spieltag",null,null,{"$f":"$N$10","v":"17./18. Jan. 2026"}]
[33,"3-2",">",{"$f":"VLOOKUP(LEFT($B56,SEARCH(\"-\",$B56)-1),$O$2:$P$9,2,FALSE)","v":"Team 3"},"-",{"$f":"VLOOKUP(RIGHT($B56,LEN($B56)-SEARCH(\"-\",$B56)),$O$2:$P$9,2,FALSE)","v":"Team 2"},"Sa/So",null,"__.__","Uhr","__"]
[34,"8-4",">",{"$f":"VLOOKUP(LEFT($B57,SEARCH(\"-\",$B57)-1),$O$2:$P$9,2,FALSE)","v":"Team 8"},"-",{"$f":"VLOOKUP(RIGHT($B57,LEN($B57)-SEARCH(\"-\",$B57)),$O$2:$P$9,2,FALSE)","v":"Team 4"},"Sa/So",null,"__.__","Uhr","__"]
[35,"1-6",">",{"$f":"VLOOKUP(LEFT($B58,SEARCH(\"-\",$B58)-1),$O$2:$P$9,2,FALSE)","v":"Team 1"},"-",{"$f":"VLOOKUP(RIGHT($B58,LEN($B58)-SEARCH(\"-\",$B58)),$O$2:$P$9,2,FALSE)","v":"Team 6"},"Sa/So",null,"__.__","Uhr","__"]
[36,"5-7",">",{"$f":"VLOOKUP(LEFT($B59,SEARCH(\"-\",$B59)-1),$O$2:$P$9,2,FALSE)","v":"Team 5"},"-",{"$f":"VLOOKUP(RIGHT($B59,LEN($B59)-SEARCH(\"-\",$B59)),$O$2:$P$9,2,FALSE)","v":"Team 7"},"Sa/So",null,"__.__","Uhr","__"]
[]
["10.Spieltag",null,null,{"$f":"$N$11","v":"24. Jan. 2026 (Sonntag Jugendspieltag)"}]
[37,"5-1",">",{"$f":"VLOOKUP(LEFT($B62,SEARCH(\"-\",$B62)-1),$O$2:$P$9,2,FALSE)","v":"Team 5"},"-",{"$f":"VLOOKUP(RIGHT($B62,LEN($B62)-SEARCH(\"-\",$B62)),$O$2:$P$9,2,FALSE)","v":"Team 1"},"Sa",null,"__.__","Uhr","__"]
[38,"7-3",">",{"$f":"VLOOKUP(LEFT($B63,SEARCH(\"-\",$B63)-1),$O$2:$P$9,2,FALSE)","v":"Team 7"},"-",{"$f":"VLOOKUP(RIGHT($B63,LEN($B63)-SEARCH(\"-\",$B63)),$O$2:$P$9,2,FALSE)","v":"Team 3"},"Sa",null,"__.__","Uhr","__"]
[39,"4-6",">",{"$f":"VLOOKUP(LEFT($B64,SEARCH(\"-\",$B64)-1),$O$2:$P$9,2,FALSE)","v":"Team 4"},"-",{"$f":"VLOOKUP(RIGHT($B64,LEN($B64)-SEARCH(\"-\",$B64)),$O$2:$P$9,2,FALSE)","v":"Team 6"},"Sa",null,"__.__","Uhr","__"]
[40,"2-8",">",{"$f":"VLOOKUP(LEFT($B65,SEARCH(\"-\",$B65)-1),$O$2:$P$9,2,FALSE)","v":"Team 2"},"-",{"$f":"VLOOKUP(RIGHT($B65,LEN($B65)-SEARCH(\"-\",$B65)),$O$2:$P$9,2,FALSE)","v":"Team 8"},"Sa",null,"__.__","Uhr","__"]
[]
["11.Spieltag",null,null,{"$f":"$N$12","v":"31. Jan./01. Feb. 2026 (Sonntag 1. Runde Bezirkspokal bis OL)"}]
[41,"6-2",">",{"$f":"VLOOKUP(LEFT($B68,SEARCH(\"-\",$B68)-1),$O$2:$P$9,2,FALSE)","v":"Team 6"},"-",{"$f":"VLOOKUP(RIGHT($B68,LEN($B68)-SEARCH(\"-\",$B68)),$O$2:$P$9,2,FALSE)","v":"Team 2"},"Sa/So",null,"__.__","Uhr","__"]
[42,"1-4",">",{"$f":"VLOOKUP(LEFT($B69,SEARCH(\"-\",$B69)-1),$O$2:$P$9,2,FALSE)","v":"Team 1"},"-",{"$f":"VLOOKUP(RIGHT($B69,LEN($B69)-SEARCH(\"-\",$B69)),$O$2:$P$9,2,FALSE)","v":"Team 4"},"Sa/So",null,"__.__","Uhr","__"]
[43,"3-5",">",{"$f":"VLOOKUP(LEFT($B70,SEARCH(\"-\",$B70)-1),$O$2:$P$9,2,FALSE)","v":"Team 3"},"-",{"$f":"VLOOKUP(RIGHT($B70,LEN($B70)-SEARCH(\"-\",$B70)),$O$2:$P$9,2,FALSE)","v":"Team 5"},"Sa/So",null,"__.__","Uhr","__"]
[44,"8-7",">",{"$f":"VLOOKUP(LEFT($B71,SEARCH(\"-\",$B71)-1),$O$2:$P$9,2,FALSE)","v":"Team 8"},"-",{"$f":"VLOOKUP(RIGHT($B71,LEN($B71)-SEARCH(\"-\",$B71)),$O$2:$P$9,2,FALSE)","v":"Team 7"},"Sa/So",null,"__.__","Uhr","__"]
[]
["12.Spieltag",null,null,{"$f":"$N$13","v":"21./22. Feb. 2026 (Sonntag 2. Runde Bezirkspokal)"}]
[45,"3-1",">",{"$f":"VLOOKUP(LEFT($B74,SEARCH(\"-\",$B74)-1),$O$2:$P$9,2,FALSE)","v":"Team 3"},"-",{"$f":"VLOOKUP(RIGHT($B74,LEN($B74)-SEARCH(\"-\",$B74)),$O$2:$P$9,2,FALSE)","v":"Team 1"},"Sa/So",null,"__.__","Uhr","__"]
[46,"2-4",">",{"$f":"VLOOKUP(LEFT($B75,SEARCH(\"-\",$B75)-1),$O$2:$P$9,2,FALSE)","v":"Team 2"},"-",{"$f":"VLOOKUP(RIGHT($B75,LEN($B75)-SEARCH(\"-\",$B75)),$O$2:$P$9,2,FALSE)","v":"Team 4"},"Sa/So",null,"__.__","Uhr","__"]
[47,"7-6",">",{"$f":"VLOOKUP(LEFT($B76,SEARCH(\"-\",$B76)-1),$O$2:$P$9,2,FALSE)","v":"Team 7"},"-",{"$f":"VLOOKUP(RIGHT($B76,LEN($B76)-SEARCH(\"-\",$B76)),$O$2:$P$9,2,FALSE)","v":"Team 6"},"Sa/So",null,"__.__","Uhr","__"]
[48,"5-8",">",{"$f":"VLOOKUP(LEFT($B77,SEARCH(\"-\",$B77)-1),$O$2:$P$9,2,FALSE)","v":"Team 5"},"-",{"$f":"VLOOKUP(RIGHT($B77,LEN($B77)-SEARCH(\"-\",$B77)),$O$2:$P$9,2,FALSE)","v":"Team 8"},"Sa/So",null,"__.__","Uhr","__"]
[]
["13.Spieltag",null,null,{"$f":"$N$14","v":"07./08. Mär. 2026"}]
[49,"2-1",">",{"$f":"VLOOKUP(LEFT($B80,SEARCH(\"-\",$B80)-1),$O$2:$P$9,2,FALSE)","v":"Team 2"},"-",{"$f":"VLOOKUP(RIGHT($B80,LEN($B80)-SEARCH(\"-\",$B80)),$O$2:$P$9,2,FALSE)","v":"Team 1"},"Sa/So",null,"__.__","Uhr","__"]
[50,"8-3",">",{"$f":"VLOOKUP(LEFT($B81,SEARCH(\"-\",$B81)-1),$O$2:$P$9,2,FALSE)","v":"Team 8"},"-",{"$f":"VLOOKUP(RIGHT($B81,LEN($B81)-SEARCH(\"-\",$B81)),$O$2:$P$9,2,FALSE)","v":"Team 3"},"Sa/So",null,"__.__","Uhr","__"]
[51,"6-5",">",{"$f":"VLOOKUP(LEFT($B82,SEARCH(\"-\",$B82)-1),$O$2:$P$9,2,FALSE)","v":"Team 6"},"-",{"$f":"VLOOKUP(RIGHT($B82,LEN($B82)-SEARCH(\"-\",$B82)),$O$2:$P$9,2,FALSE)","v":"Team 5"},"Sa/So",null,"__.__","Uhr","__"]
[52,"4-7",">",{"$f":"VLOOKUP(LEFT($B83,SEARCH(\"-\",$B83)-1),$O$2:$P$9,2,FALSE)","v":"Team 4"},"-",{"$f":"VLOOKUP(RIGHT($B83,LEN($B83)-SEARCH(\"-\",$B83)),$O$2:$P$9,2,FALSE)","v":"Team 7"},"Sa/So",null,"__.__","Uhr","__"]
[]
["14.Spieltag",null,null,{"$f":"$N$15","v":"21./22. Mär. 2026"}]
[53,"7-2",">",{"$f":"VLOOKUP(LEFT($B86,SEARCH(\"-\",$B86)-1),$O$2:$P$9,2,FALSE)","v":"Team 7"},"-",{"$f":"VLOOKUP(RIGHT($B86,LEN($B86)-SEARCH(\"-\",$B86)),$O$2:$P$9,2,FALSE)","v":"Team 2"},"Sa/So",null,"__.__","Uhr","__"]
[54,"5-4",">",{"$f":"VLOOKUP(LEFT($B87,SEARCH(\"-\",$B87)-1),$O$2:$P$9,2,FALSE)","v":"Team 5"},"-",{"$f":"VLOOKUP(RIGHT($B87,LEN($B87)-SEARCH(\"-\",$B87)),$O$2:$P$9,2,FALSE)","v":"Team 4"},"Sa/So",null,"__.__","Uhr","__"]
[55,"3-6",">",{"$f":"VLOOKUP(LEFT($B88,SEARCH(\"-\",$B88)-1),$O$2:$P$9,2,FALSE)","v":"Team 3"},"-",{"$f":"VLOOKUP(RIGHT($B88,LEN($B88)-SEARCH(\"-\",$B88)),$O$2:$P$9,2,FALSE)","v":"Team 6"},"Sa/So",null,"__.__","Uhr","__"]
[56,"1-8",">",{"$f":"VLOOKUP(LEFT($B89,SEARCH(\"-\",$B89)-1),$O$2:$P$9,2,FALSE)","v":"Team 1"},"-",{"$f":"VLOOKUP(RIGHT($B89,LEN($B89)-SEARCH(\"-\",$B89)),$O$2:$P$9,2,FALSE)","v":"Team 8"},"Sa/So",null,"__.__","Uhr","__"]
[]
["Relegation: 01. – 03. Mai 2026"]
[]
["####   Mit   >   gekennzeichnete Mannschaften haben Heimrecht   ####"]

{"sheet":"WVV 9 auf 18 Einzelspiele","index":6,"n_rows":116,"n_cols":16,"rows_kept":116,"cut":false,"hidden":false,"merged":[]}
[{"$f":"\"WVV-Spielplan: \"&N1","v":"WVV-Spielplan: Liga x Frauen / Männer"},null,null,null,null,null,"Saison 2025/26",null,null,null,"Seite 1(2)",null,null,"Liga x Frauen / Männer"]
[null,null,null,null,null,null,null,null,null,null,"Halle",null,"1.","20./21. Sept. 2025 (Sonntag WVV-Pokal)","1","Team 1"]
["1.Spieltag",null,null,{"$f":"$N$2","v":"20./21. Sept. 2025 (Sonntag WVV-Pokal)"},null,null,null,null,null,null,null,null,"2.","04./05. Okt. 2025","2","Team 2"]
[1,"1-9",">",{"$f":"VLOOKUP(LEFT($B4,SEARCH(\"-\",$B4)-1),$O$2:$P$10,2,FALSE)","v":"Team 1"},"-",{"$f":"VLOOKUP(RIGHT($B4,LEN($B4)-SEARCH(\"-\",$B4)),$O$2:$P$10,2,FALSE)","v":"Team 9"},"Sa/So",null,"__.__","Uhr","__",null,"3.","11./12. Okt. 2025 (Sonntag WVV-Pokalfinale)","3","Team 3"]
[{"$f":"A4+1","v":2},"3-6",">",{"$f":"VLOOKUP(LEFT($B5,SEARCH(\"-\",$B5)-1),$O$2:$P$10,2,FALSE)","v":"Team 3"},"-",{"$f":"VLOOKUP(RIGHT($B5,LEN($B5)-SEARCH(\"-\",$B5)),$O$2:$P$10,2,FALSE)","v":"Team 6"},"Sa/So",null,"__.__","Uhr","__",null,"4.","18./19. Okt. 2025","4","Team 4"]
[{"$f":"A5+1","v":3},"5-4",">",{"$f":"VLOOKUP(LEFT($B6,SEARCH(\"-\",$B6)-1),$O$2:$P$10,2,FALSE)","v":"Team 5"},"-",{"$f":"VLOOKUP(RIGHT($B6,LEN($B6)-SEARCH(\"-\",$B6)),$O$2:$P$10,2,FALSE)","v":"Team 4"},"Sa/So",null,"__.__","Uhr","__",null,"5.","25./26. Okt. 2025","5","Team 5"]
[{"$f":"A6+1","v":4},"7-2",">",{"$f":"VLOOKUP(LEFT($B7,SEARCH(\"-\",$B7)-1),$O$2:$P$10,2,FALSE)","v":"Team 7"},"-",{"$f":"VLOOKUP(RIGHT($B7,LEN($B7)-SEARCH(\"-\",$B7)),$O$2:$P$10,2,FALSE)","v":"Team 2"},"Sa/So",null,"__.__","Uhr","__",null,"6.","01./02. Nov. 2025 (Samstag Allerheiligen Spielverbot bis 18.00 Uhr)","6","Team 6"]
[null,null,null,null,null,null,null,null,null,null,null,null,"7.","15./16. Nov. 2025 (Sonntag Volkstrauertag Spielverbot bis 13.00 Uhr)","7","Team 7"]
["2.Spieltag",null,null,{"$f":"$N$3","v":"04./05. Okt. 2025"},null,null,null,null,null,null,null,null,"8.","22. Nov. 2025 (Sonntag Totensonntag Spielverbot bis 18.00 Uhr)","8","Team 8"]
[5,"2-5",">",{"$f":"VLOOKUP(LEFT($B10,SEARCH(\"-\",$B10)-1),$O$2:$P$10,2,FALSE)","v":"Team 2"},"-",{"$f":"VLOOKUP(RIGHT($B10,LEN($B10)-SEARCH(\"-\",$B10)),$O$2:$P$10,2,FALSE)","v":"Team 5"},"Sa/So",null,"__.__","Uhr","__",null,"9.","06./07. Dez. 2025","9","Team 9"]
[{"$f":"A10+1","v":6},"4-3",">",{"$f":"VLOOKUP(LEFT($B11,SEARCH(\"-\",$B11)-1),$O$2:$P$10,2,FALSE)","v":"Team 4"},"-",{"$f":"VLOOKUP(RIGHT($B11,LEN($B11)-SEARCH(\"-\",$B11)),$O$2:$P$10,2,FALSE)","v":"Team 3"},"Sa/So",null,"__.__","Uhr","__",null,"10.","20./21. Dez. 2025"]
[{"$f":"A11+1","v":7},"8-1",">",{"$f":"VLOOKUP(LEFT($B12,SEARCH(\"-\",$B12)-1),$O$2:$P$10,2,FALSE)","v":"Team 8"},"-",{"$f":"VLOOKUP(RIGHT($B12,LEN($B12)-SEARCH(\"-\",$B12)),$O$2:$P$10,2,FALSE)","v":"Team 1"},"Sa/So",null,"__.__","Uhr","__",null,"11.","10. Jan. 2026 (Sonntag Jugendspieltag)"]
[{"$f":"A12+1","v":8},"9-7",">",{"$f":"VLOOKUP(LEFT($B13,SEARCH(\"-\",$B13)-1),$O$2:$P$10,2,FALSE)","v":"Team 9"},"-",{"$f":"VLOOKUP(RIGHT($B13,LEN($B13)-SEARCH(\"-\",$B13)),$O$2:$P$10,2,FALSE)","v":"Team 7"},"Sa/So",null,"__.__","Uhr","__",null,"12.","17./18. Jan. 2026"]
[null,null,null,null,null,null,null,null,null,null,null,null,"13.","24. Jan. 2026 (Sonntag Jugendspieltag)"]
["3.Spieltag",null,null,{"$f":"$N$4","v":"11./12. Okt. 2025 (Sonntag WVV-Pokalfinale)"},null,null,null,null,null,null,null,null,"14.","31. Jan./01. Feb. 2026 (Sonntag 1. Runde Bezirkspokal bis OL)"]
[9,"1-7",">",{"$f":"VLOOKUP(LEFT($B16,SEARCH(\"-\",$B16)-1),$O$2:$P$10,2,FALSE)","v":"Team 1"},"-",{"$f":"VLOOKUP(RIGHT($B16,LEN($B16)-SEARCH(\"-\",$B16)),$O$2:$P$10,2,FALSE)","v":"Team 7"},"Sa/So",null,"__.__","Uhr","__",null,"15.","14./15. Feb. 2026 (Sonntag Karneval)"]
[{"$f":"A16+1","v":10},"3-2",">",{"$f":"VLOOKUP(LEFT($B17,SEARCH(\"-\",$B17)-1),$O$2:$P$10,2,FALSE)","v":"Team 3"},"-",{"$f":"VLOOKUP(RIGHT($B17,LEN($B17)-SEARCH(\"-\",$B17)),$O$2:$P$10,2,FALSE)","v":"Team 2"},"Sa/So",null,"__.__","Uhr","__",null,"16.","21./22. Feb. 2026 (Sonntag 2. Runde Bezirkspokal)"]
[{"$f":"A17+1","v":11},"5-9",">",{"$f":"VLOOKUP(LEFT($B18,SEARCH(\"-\",$B18)-1),$O$2:$P$10,2,FALSE)","v":"Team 5"},"-",{"$f":"VLOOKUP(RIGHT($B18,LEN($B18)-SEARCH(\"-\",$B18)),$O$2:$P$10,2,FALSE)","v":"Team 9"},"Sa/So",null,"__.__","Uhr","__",null,"17.","07./08. Mär. 2026"]
[{"$f":"A18+1","v":12},"8-6",">",{"$f":"VLOOKUP(LEFT($B19,SEARCH(\"-\",$B19)-1),$O$2:$P$10,2,FALSE)","v":"Team 8"},"-",{"$f":"VLOOKUP(RIGHT($B19,LEN($B19)-SEARCH(\"-\",$B19)),$O$2:$P$10,2,FALSE)","v":"Team 6"},"Sa/So",null,"__.__","Uhr","__",null,"18.","21./22. Mär. 2026"]
[]
["4.Spieltag",null,null,{"$f":"$N$5","v":"18./19. Okt. 2025"}]
[13,"4-8",">",{"$f":"VLOOKUP(LEFT($B22,SEARCH(\"-\",$B22)-1),$O$2:$P$10,2,FALSE)","v":"Team 4"},"-",{"$f":"VLOOKUP(RIGHT($B22,LEN($B22)-SEARCH(\"-\",$B22)),$O$2:$P$10,2,FALSE)","v":"Team 8"},"Sa/So",null,"__.__","Uhr","__"]
[{"$f":"A22+1","v":14},"6-1",">",{"$f":"VLOOKUP(LEFT($B23,SEARCH(\"-\",$B23)-1),$O$2:$P$10,2,FALSE)","v":"Team 6"},"-",{"$f":"VLOOKUP(RIGHT($B23,LEN($B23)-SEARCH(\"-\",$B23)),$O$2:$P$10,2,FALSE)","v":"Team 1"},"Sa/So",null,"__.__","Uhr","__"]
[{"$f":"A23+1","v":15},"7-5",">",{"$f":"VLOOKUP(LEFT($B24,SEARCH(\"-\",$B24)-1),$O$2:$P$10,2,FALSE)","v":"Team 7"},"-",{"$f":"VLOOKUP(RIGHT($B24,LEN($B24)-SEARCH(\"-\",$B24)),$O$2:$P$10,2,FALSE)","v":"Team 5"},"Sa/So",null,"__.__","Uhr","__"]
[{"$f":"A24+1","v":16},"9-3",">",{"$f":"VLOOKUP(LEFT($B25,SEARCH(\"-\",$B25)-1),$O$2:$P$10,2,FALSE)","v":"Team 9"},"-",{"$f":"VLOOKUP(RIGHT($B25,LEN($B25)-SEARCH(\"-\",$B25)),$O$2:$P$10,2,FALSE)","v":"Team 3"},"Sa/So",null,"__.__","Uhr","__"]
[]
["5.Spieltag",null,null,{"$f":"$N$6","v":"25./26. Okt. 2025"}]
[17,"1-5",">",{"$f":"VLOOKUP(LEFT($B28,SEARCH(\"-\",$B28)-1),$O$2:$P$10,2,FALSE)","v":"Team 1"},"-",{"$f":"VLOOKUP(RIGHT($B28,LEN($B28)-SEARCH(\"-\",$B28)),$O$2:$P$10,2,FALSE)","v":"Team 5"},"Sa/So",null,"__.__","Uhr","__"]
[{"$f":"A28+1","v":18},"3-7",">",{"$f":"VLOOKUP(LEFT($B29,SEARCH(\"-\",$B29)-1),$O$2:$P$10,2,FALSE)","v":"Team 3"},"-",{"$f":"VLOOKUP(RIGHT($B29,LEN($B29)-SEARCH(\"-\",$B29)),$O$2:$P$10,2,FALSE)","v":"Team 7"},"Sa/So",null,"__.__","Uhr","__"]
[{"$f":"A29+1","v":19},"6-4",">",{"$f":"VLOOKUP(LEFT($B30,SEARCH(\"-\",$B30)-1),$O$2:$P$10,2,FALSE)","v":"Team 6"},"-",{"$f":"VLOOKUP(RIGHT($B30,LEN($B30)-SEARCH(\"-\",$B30)),$O$2:$P$10,2,FALSE)","v":"Team 4"},"Sa/So",null,"__.__","Uhr","__"]
[{"$f":"A30+1","v":20},"8-2",">",{"$f":"VLOOKUP(LEFT($B31,SEARCH(\"-\",$B31)-1),$O$2:$P$10,2,FALSE)","v":"Team 8"},"-",{"$f":"VLOOKUP(RIGHT($B31,LEN($B31)-SEARCH(\"-\",$B31)),$O$2:$P$10,2,FALSE)","v":"Team 2"},"Sa/So",null,"__.__","Uhr","__"]
[]
["6.Spieltag",null,null,{"$f":"$N$7","v":"01./02. Nov. 2025 (Samstag Allerheiligen Spielverbot bis 18.00 Uhr)"}]
[21,"2-6",">",{"$f":"VLOOKUP(LEFT($B34,SEARCH(\"-\",$B34)-1),$O$2:$P$10,2,FALSE)","v":"Team 2"},"-",{"$f":"VLOOKUP(RIGHT($B34,LEN($B34)-SEARCH(\"-\",$B34)),$O$2:$P$10,2,FALSE)","v":"Team 6"},"So",null,"__.__","Uhr","__"]
[{"$f":"A34+1","v":22},"4-1",">",{"$f":"VLOOKUP(LEFT($B35,SEARCH(\"-\",$B35)-1),$O$2:$P$10,2,FALSE)","v":"Team 4"},"-",{"$f":"VLOOKUP(RIGHT($B35,LEN($B35)-SEARCH(\"-\",$B35)),$O$2:$P$10,2,FALSE)","v":"Team 1"},"So",null,"__.__","Uhr","__"]
[{"$f":"A35+1","v":23},"5-3",">",{"$f":"VLOOKUP(LEFT($B36,SEARCH(\"-\",$B36)-1),$O$2:$P$10,2,FALSE)","v":"Team 5"},"-",{"$f":"VLOOKUP(RIGHT($B36,LEN($B36)-SEARCH(\"-\",$B36)),$O$2:$P$10,2,FALSE)","v":"Team 3"},"So",null,"__.__","Uhr","__"]
[{"$f":"A36+1","v":24},"9-8",">",{"$f":"VLOOKUP(LEFT($B37,SEARCH(\"-\",$B37)-1),$O$2:$P$10,2,FALSE)","v":"Team 9"},"-",{"$f":"VLOOKUP(RIGHT($B37,LEN($B37)-SEARCH(\"-\",$B37)),$O$2:$P$10,2,FALSE)","v":"Team 8"},"So",null,"__.__","Uhr","__"]
[]
["7.Spieltag",null,null,{"$f":"$N$8","v":"15./16. Nov. 2025 (Sonntag Volkstrauertag Spielverbot bis 13.00 Uhr)"}]
[25,"1-3",">",{"$f":"VLOOKUP(LEFT($B40,SEARCH(\"-\",$B40)-1),$O$2:$P$10,2,FALSE)","v":"Team 1"},"-",{"$f":"VLOOKUP(RIGHT($B40,LEN($B40)-SEARCH(\"-\",$B40)),$O$2:$P$10,2,FALSE)","v":"Team 3"},"Sa/So",null,"__.__","Uhr","__"]
[{"$f":"A40+1","v":26},"4-2",">",{"$f":"VLOOKUP(LEFT($B41,SEARCH(\"-\",$B41)-1),$O$2:$P$10,2,FALSE)","v":"Team 4"},"-",{"$f":"VLOOKUP(RIGHT($B41,LEN($B41)-SEARCH(\"-\",$B41)),$O$2:$P$10,2,FALSE)","v":"Team 2"},"Sa/So",null,"__.__","Uhr","__"]
[{"$f":"A41+1","v":27},"6-9",">",{"$f":"VLOOKUP(LEFT($B42,SEARCH(\"-\",$B42)-1),$O$2:$P$10,2,FALSE)","v":"Team 6"},"-",{"$f":"VLOOKUP(RIGHT($B42,LEN($B42)-SEARCH(\"-\",$B42)),$O$2:$P$10,2,FALSE)","v":"Team 9"},"Sa/So",null,"__.__","Uhr","__"]
[{"$f":"A42+1","v":28},"8-7",">",{"$f":"VLOOKUP(LEFT($B43,SEARCH(\"-\",$B43)-1),$O$2:$P$10,2,FALSE)","v":"Team 8"},"-",{"$f":"VLOOKUP(RIGHT($B43,LEN($B43)-SEARCH(\"-\",$B43)),$O$2:$P$10,2,FALSE)","v":"Team 7"},"Sa/So",null,"__.__","Uhr","__"]
[]
["8.Spieltag",null,null,{"$f":"$N$9","v":"22. Nov. 2025 (Sonntag Totensonntag Spielverbot bis 18.00 Uhr)"}]
[29,"1-2",">",{"$f":"VLOOKUP(LEFT($B46,SEARCH(\"-\",$B46)-1),$O$2:$P$10,2,FALSE)","v":"Team 1"},"-",{"$f":"VLOOKUP(RIGHT($B46,LEN($B46)-SEARCH(\"-\",$B46)),$O$2:$P$10,2,FALSE)","v":"Team 2"},"Sa",null,"__.__","Uhr","__"]
[{"$f":"A46+1","v":30},"5-8",">",{"$f":"VLOOKUP(LEFT($B47,SEARCH(\"-\",$B47)-1),$O$2:$P$10,2,FALSE)","v":"Team 5"},"-",{"$f":"VLOOKUP(RIGHT($B47,LEN($B47)-SEARCH(\"-\",$B47)),$O$2:$P$10,2,FALSE)","v":"Team 8"},"Sa",null,"__.__","Uhr","__"]
[{"$f":"A47+1","v":31},"7-6",">",{"$f":"VLOOKUP(LEFT($B48,SEARCH(\"-\",$B48)-1),$O$2:$P$10,2,FALSE)","v":"Team 7"},"-",{"$f":"VLOOKUP(RIGHT($B48,LEN($B48)-SEARCH(\"-\",$B48)),$O$2:$P$10,2,FALSE)","v":"Team 6"},"Sa",null,"__.__","Uhr","__"]
[{"$f":"A48+1","v":32},"9-4",">",{"$f":"VLOOKUP(LEFT($B49,SEARCH(\"-\",$B49)-1),$O$2:$P$10,2,FALSE)","v":"Team 9"},"-",{"$f":"VLOOKUP(RIGHT($B49,LEN($B49)-SEARCH(\"-\",$B49)),$O$2:$P$10,2,FALSE)","v":"Team 4"},"Sa",null,"__.__","Uhr","__"]
[]
["9.Spieltag",null,null,{"$f":"$N$10","v":"06./07. Dez. 2025"}]
[33,"2-9",">",{"$f":"VLOOKUP(LEFT($B52,SEARCH(\"-\",$B52)-1),$O$2:$P$10,2,FALSE)","v":"Team 2"},"-",{"$f":"VLOOKUP(RIGHT($B52,LEN($B52)-SEARCH(\"-\",$B52)),$O$2:$P$10,2,FALSE)","v":"Team 9"},"Sa/So",null,"__.__","Uhr","__"]
[{"$f":"A52+1","v":34},"4-7",">",{"$f":"VLOOKUP(LEFT($B53,SEARCH(\"-\",$B53)-1),$O$2:$P$10,2,FALSE)","v":"Team 4"},"-",{"$f":"VLOOKUP(RIGHT($B53,LEN($B53)-SEARCH(\"-\",$B53)),$O$2:$P$10,2,FALSE)","v":"Team 7"},"Sa/So",null,"__.__","Uhr","__"]
[{"$f":"A53+1","v":35},"6-5",">",{"$f":"VLOOKUP(LEFT($B54,SEARCH(\"-\",$B54)-1),$O$2:$P$10,2,FALSE)","v":"Team 6"},"-",{"$f":"VLOOKUP(RIGHT($B54,LEN($B54)-SEARCH(\"-\",$B54)),$O$2:$P$10,2,FALSE)","v":"Team 5"},"Sa/So",null,"__.__","Uhr","__"]
[{"$f":"A54+1","v":36},"8-3",">",{"$f":"VLOOKUP(LEFT($B55,SEARCH(\"-\",$B55)-1),$O$2:$P$10,2,FALSE)","v":"Team 8"},"-",{"$f":"VLOOKUP(RIGHT($B55,LEN($B55)-SEARCH(\"-\",$B55)),$O$2:$P$10,2,FALSE)","v":"Team 3"},"Sa/So",null,"__.__","Uhr","__"]
[]
["####   Mit   >   gekennzeichnete Mannschaften haben Heimrecht   ####"]
[{"$f":"A1","v":"WVV-Spielplan: Liga x Frauen / Männer"},null,null,null,null,null,{"$f":"G1","v":"Saison 2025/26"},null,null,null,"Seite 2(2)"]
[null,null,null,null,null,null,null,null,null,null,"Halle"]
["10.Spieltag",null,null,{"$f":"$N$11","v":"20./21. Dez. 2025"}]
[37,"9-1",">",{"$f":"VLOOKUP(LEFT($B61,SEARCH(\"-\",$B61)-1),$O$2:$P$10,2,FALSE)","v":"Team 9"},"-",{"$f":"VLOOKUP(RIGHT($B61,LEN($B61)-SEARCH(\"-\",$B61)),$O$2:$P$10,2,FALSE)","v":"Team 1"},"Sa/So",null,"__.__","Uhr","__"]
[{"$f":"A61+1","v":38},"6-3",">",{"$f":"VLOOKUP(LEFT($B62,SEARCH(\"-\",$B62)-1),$O$2:$P$10,2,FALSE)","v":"Team 6"},"-",{"$f":"VLOOKUP(RIGHT($B62,LEN($B62)-SEARCH(\"-\",$B62)),$O$2:$P$10,2,FALSE)","v":"Team 3"},"Sa/So",null,"__.__","Uhr","__"]
[{"$f":"A62+1","v":39},"4-5",">",{"$f":"VLOOKUP(LEFT($B63,SEARCH(\"-\",$B63)-1),$O$2:$P$10,2,FALSE)","v":"Team 4"},"-",{"$f":"VLOOKUP(RIGHT($B63,LEN($B63)-SEARCH(\"-\",$B63)),$O$2:$P$10,2,FALSE)","v":"Team 5"},"Sa/So",null,"__.__","Uhr","__"]
[{"$f":"A63+1","v":40},"2-7",">",{"$f":"VLOOKUP(LEFT($B64,SEARCH(\"-\",$B64)-1),$O$2:$P$10,2,FALSE)","v":"Team 2"},"-",{"$f":"VLOOKUP(RIGHT($B64,LEN($B64)-SEARCH(\"-\",$B64)),$O$2:$P$10,2,FALSE)","v":"Team 7"},"Sa/So",null,"__.__","Uhr","__"]
[]
["11.Spieltag",null,null,{"$f":"$N$12","v":"10. Jan. 2026 (Sonntag Jugendspieltag)"}]
[41,"5-2",">",{"$f":"VLOOKUP(LEFT($B67,SEARCH(\"-\",$B67)-1),$O$2:$P$10,2,FALSE)","v":"Team 5"},"-",{"$f":"VLOOKUP(RIGHT($B67,LEN($B67)-SEARCH(\"-\",$B67)),$O$2:$P$10,2,FALSE)","v":"Team 2"},"Sa",null,"__.__","Uhr","__"]
[{"$f":"A67+1","v":42},"3-4",">",{"$f":"VLOOKUP(LEFT($B68,SEARCH(\"-\",$B68)-1),$O$2:$P$10,2,FALSE)","v":"Team 3"},"-",{"$f":"VLOOKUP(RIGHT($B68,LEN($B68)-SEARCH(\"-\",$B68)),$O$2:$P$10,2,FALSE)","v":"Team 4"},"Sa",null,"__.__","Uhr","__"]
[{"$f":"A68+1","v":43},"1-8",">",{"$f":"VLOOKUP(LEFT($B69,SEARCH(\"-\",$B69)-1),$O$2:$P$10,2,FALSE)","v":"Team 1"},"-",{"$f":"VLOOKUP(RIGHT($B69,LEN($B69)-SEARCH(\"-\",$B69)),$O$2:$P$10,2,FALSE)","v":"Team 8"},"Sa",null,"__.__","Uhr","__"]
[{"$f":"A69+1","v":44},"7-9",">",{"$f":"VLOOKUP(LEFT($B70,SEARCH(\"-\",$B70)-1),$O$2:$P$10,2,FALSE)","v":"Team 7"},"-",{"$f":"VLOOKUP(RIGHT($B70,LEN($B70)-SEARCH(\"-\",$B70)),$O$2:$P$10,2,FALSE)","v":"Team 9"},"Sa",null,"__.__","Uhr","__"]
[]
["12.Spieltag",null,null,{"$f":"$N$13","v":"17./18. Jan. 2026"}]
[45,"7-1",">",{"$f":"VLOOKUP(LEFT($B73,SEARCH(\"-\",$B73)-1),$O$2:$P$10,2,FALSE)","v":"Team 7"},"-",{"$f":"VLOOKUP(RIGHT($B73,LEN($B73)-SEARCH(\"-\",$B73)),$O$2:$P$10,2,FALSE)","v":"Team 1"},"Sa/So",null,"__.__","Uhr","__"]
[{"$f":"A73+1","v":46},"2-3",">",{"$f":"VLOOKUP(LEFT($B74,SEARCH(\"-\",$B74)-1),$O$2:$P$10,2,FALSE)","v":"Team 2"},"-",{"$f":"VLOOKUP(RIGHT($B74,LEN($B74)-SEARCH(\"-\",$B74)),$O$2:$P$10,2,FALSE)","v":"Team 3"},"Sa/So",null,"__.__","Uhr","__"]
[{"$f":"A74+1","v":47},"9-5",">",{"$f":"VLOOKUP(LEFT($B75,SEARCH(\"-\",$B75)-1),$O$2:$P$10,2,FALSE)","v":"Team 9"},"-",{"$f":"VLOOKUP(RIGHT($B75,LEN($B75)-SEARCH(\"-\",$B75)),$O$2:$P$10,2,FALSE)","v":"Team 5"},"Sa/So",null,"__.__","Uhr","__"]
[{"$f":"A75+1","v":48},"6-8",">",{"$f":"VLOOKUP(LEFT($B76,SEARCH(\"-\",$B76)-1),$O$2:$P$10,2,FALSE)","v":"Team 6"},"-",{"$f":"VLOOKUP(RIGHT($B76,LEN($B76)-SEARCH(\"-\",$B76)),$O$2:$P$10,2,FALSE)","v":"Team 8"},"Sa/So",null,"__.__","Uhr","__"]
[]
["13.Spieltag",null,null,{"$f":"$N$14","v":"24. Jan. 2026 (Sonntag Jugendspieltag)"}]
[49,"8-4",">",{"$f":"VLOOKUP(LEFT($B79,SEARCH(\"-\",$B79)-1),$O$2:$P$10,2,FALSE)","v":"Team 8"},"-",{"$f":"VLOOKUP(RIGHT($B79,LEN($B79)-SEARCH(\"-\",$B79)),$O$2:$P$10,2,FALSE)","v":"Team 4"},"Sa",null,"__.__","Uhr","__"]
[{"$f":"A79+1","v":50},"1-6",">",{"$f":"VLOOKUP(LEFT($B80,SEARCH(\"-\",$B80)-1),$O$2:$P$10,2,FALSE)","v":"Team 1"},"-",{"$f":"VLOOKUP(RIGHT($B80,LEN($B80)-SEARCH(\"-\",$B80)),$O$2:$P$10,2,FALSE)","v":"Team 6"},"Sa",null,"__.__","Uhr","__"]
[{"$f":"A80+1","v":51},"5-7",">",{"$f":"VLOOKUP(LEFT($B81,SEARCH(\"-\",$B81)-1),$O$2:$P$10,2,FALSE)","v":"Team 5"},"-",{"$f":"VLOOKUP(RIGHT($B81,LEN($B81)-SEARCH(\"-\",$B81)),$O$2:$P$10,2,FALSE)","v":"Team 7"},"Sa",null,"__.__","Uhr","__"]
[{"$f":"A81+1","v":52},"3-9",">",{"$f":"VLOOKUP(LEFT($B82,SEARCH(\"-\",$B82)-1),$O$2:$P$10,2,FALSE)","v":"Team 3"},"-",{"$f":"VLOOKUP(RIGHT($B82,LEN($B82)-SEARCH(\"-\",$B82)),$O$2:$P$10,2,FALSE)","v":"Team 9"},"Sa",null,"__.__","Uhr","__"]
[]
["14.Spieltag",null,null,{"$f":"$N$15","v":"31. Jan./01. Feb. 2026 (Sonntag 1. Runde Bezirkspokal bis OL)"}]
[53,"5-1",">",{"$f":"VLOOKUP(LEFT($B85,SEARCH(\"-\",$B85)-1),$O$2:$P$10,2,FALSE)","v":"Team 5"},"-",{"$f":"VLOOKUP(RIGHT($B85,LEN($B85)-SEARCH(\"-\",$B85)),$O$2:$P$10,2,FALSE)","v":"Team 1"},"Sa/So",null,"__.__","Uhr","__"]
[{"$f":"A85+1","v":54},"7-3",">",{"$f":"VLOOKUP(LEFT($B86,SEARCH(\"-\",$B86)-1),$O$2:$P$10,2,FALSE)","v":"Team 7"},"-",{"$f":"VLOOKUP(RIGHT($B86,LEN($B86)-SEARCH(\"-\",$B86)),$O$2:$P$10,2,FALSE)","v":"Team 3"},"Sa/So",null,"__.__","Uhr","__"]
[{"$f":"A86+1","v":55},"4-6",">",{"$f":"VLOOKUP(LEFT($B87,SEARCH(\"-\",$B87)-1),$O$2:$P$10,2,FALSE)","v":"Team 4"},"-",{"$f":"VLOOKUP(RIGHT($B87,LEN($B87)-SEARCH(\"-\",$B87)),$O$2:$P$10,2,FALSE)","v":"Team 6"},"Sa/So",null,"__.__","Uhr","__"]
[{"$f":"A87+1","v":56},"2-8",">",{"$f":"VLOOKUP(LEFT($B88,SEARCH(\"-\",$B88)-1),$O$2:$P$10,2,FALSE)","v":"Team 2"},"-",{"$f":"VLOOKUP(RIGHT($B88,LEN($B88)-SEARCH(\"-\",$B88)),$O$2:$P$10,2,FALSE)","v":"Team 8"},"Sa/So",null,"__.__","Uhr","__"]
[]
["15.Spieltag",null,null,{"$f":"$N$16","v":"14./15. Feb. 2026 (Sonntag Karneval)"}]
[57,"6-2",">",{"$f":"VLOOKUP(LEFT($B91,SEARCH(\"-\",$B91)-1),$O$2:$P$10,2,FALSE)","v":"Team 6"},"-",{"$f":"VLOOKUP(RIGHT($B91,LEN($B91)-SEARCH(\"-\",$B91)),$O$2:$P$10,2,FALSE)","v":"Team 2"},"Sa/So",null,"__.__","Uhr","__"]
[{"$f":"A91+1","v":58},"1-4",">",{"$f":"VLOOKUP(LEFT($B92,SEARCH(\"-\",$B92)-1),$O$2:$P$10,2,FALSE)","v":"Team 1"},"-",{"$f":"VLOOKUP(RIGHT($B92,LEN($B92)-SEARCH(\"-\",$B92)),$O$2:$P$10,2,FALSE)","v":"Team 4"},"Sa/So",null,"__.__","Uhr","__"]
[{"$f":"A92+1","v":59},"3-5",">",{"$f":"VLOOKUP(LEFT($B93,SEARCH(\"-\",$B93)-1),$O$2:$P$10,2,FALSE)","v":"Team 3"},"-",{"$f":"VLOOKUP(RIGHT($B93,LEN($B93)-SEARCH(\"-\",$B93)),$O$2:$P$10,2,FALSE)","v":"Team 5"},"Sa/So",null,"__.__","Uhr","__"]
[{"$f":"A93+1","v":60},"8-9",">",{"$f":"VLOOKUP(LEFT($B94,SEARCH(\"-\",$B94)-1),$O$2:$P$10,2,FALSE)","v":"Team 8"},"-",{"$f":"VLOOKUP(RIGHT($B94,LEN($B94)-SEARCH(\"-\",$B94)),$O$2:$P$10,2,FALSE)","v":"Team 9"},"Sa/So",null,"__.__","Uhr","__"]
[]
["16.Spieltag",null,null,{"$f":"$N$17","v":"21./22. Feb. 2026 (Sonntag 2. Runde Bezirkspokal)"}]
[61,"3-1",">",{"$f":"VLOOKUP(LEFT($B97,SEARCH(\"-\",$B97)-1),$O$2:$P$10,2,FALSE)","v":"Team 3"},"-",{"$f":"VLOOKUP(RIGHT($B97,LEN($B97)-SEARCH(\"-\",$B97)),$O$2:$P$10,2,FALSE)","v":"Team 1"},"Sa/So",null,"__.__","Uhr","__"]
[{"$f":"A97+1","v":62},"2-4",">",{"$f":"VLOOKUP(LEFT($B98,SEARCH(\"-\",$B98)-1),$O$2:$P$10,2,FALSE)","v":"Team 2"},"-",{"$f":"VLOOKUP(RIGHT($B98,LEN($B98)-SEARCH(\"-\",$B98)),$O$2:$P$10,2,FALSE)","v":"Team 4"},"Sa/So",null,"__.__","Uhr","__"]
[{"$f":"A98+1","v":63},"9-6",">",{"$f":"VLOOKUP(LEFT($B99,SEARCH(\"-\",$B99)-1),$O$2:$P$10,2,FALSE)","v":"Team 9"},"-",{"$f":"VLOOKUP(RIGHT($B99,LEN($B99)-SEARCH(\"-\",$B99)),$O$2:$P$10,2,FALSE)","v":"Team 6"},"Sa/So",null,"__.__","Uhr","__"]
[{"$f":"A99+1","v":64},"7-8",">",{"$f":"VLOOKUP(LEFT($B100,SEARCH(\"-\",$B100)-1),$O$2:$P$10,2,FALSE)","v":"Team 7"},"-",{"$f":"VLOOKUP(RIGHT($B100,LEN($B100)-SEARCH(\"-\",$B100)),$O$2:$P$10,2,FALSE)","v":"Team 8"},"Sa/So",null,"__.__","Uhr","__"]
[]
["17.Spieltag",null,null,{"$f":"$N$18","v":"07./08. Mär. 2026"}]
[65,"2-1",">",{"$f":"VLOOKUP(LEFT($B103,SEARCH(\"-\",$B103)-1),$O$2:$P$10,2,FALSE)","v":"Team 2"},"-",{"$f":"VLOOKUP(RIGHT($B103,LEN($B103)-SEARCH(\"-\",$B103)),$O$2:$P$10,2,FALSE)","v":"Team 1"},"Sa/So",null,"__.__","Uhr","__"]
[{"$f":"A103+1","v":66},"8-5",">",{"$f":"VLOOKUP(LEFT($B104,SEARCH(\"-\",$B104)-1),$O$2:$P$10,2,FALSE)","v":"Team 8"},"-",{"$f":"VLOOKUP(RIGHT($B104,LEN($B104)-SEARCH(\"-\",$B104)),$O$2:$P$10,2,FALSE)","v":"Team 5"},"Sa/So",null,"__.__","Uhr","__"]
[{"$f":"A104+1","v":67},"6-7",">",{"$f":"VLOOKUP(LEFT($B105,SEARCH(\"-\",$B105)-1),$O$2:$P$10,2,FALSE)","v":"Team 6"},"-",{"$f":"VLOOKUP(RIGHT($B105,LEN($B105)-SEARCH(\"-\",$B105)),$O$2:$P$10,2,FALSE)","v":"Team 7"},"Sa/So",null,"__.__","Uhr","__"]
[{"$f":"A105+1","v":68},"4-9",">",{"$f":"VLOOKUP(LEFT($B106,SEARCH(\"-\",$B106)-1),$O$2:$P$10,2,FALSE)","v":"Team 4"},"-",{"$f":"VLOOKUP(RIGHT($B106,LEN($B106)-SEARCH(\"-\",$B106)),$O$2:$P$10,2,FALSE)","v":"Team 9"},"Sa/So",null,"__.__","Uhr","__"]
[]
["18.Spieltag",null,null,{"$f":"$N$19","v":"21./22. Mär. 2026"}]
[69,"9-2",">",{"$f":"VLOOKUP(LEFT($B109,SEARCH(\"-\",$B109)-1),$O$2:$P$10,2,FALSE)","v":"Team 9"},"-",{"$f":"VLOOKUP(RIGHT($B109,LEN($B109)-SEARCH(\"-\",$B109)),$O$2:$P$10,2,FALSE)","v":"Team 2"},"Sa/So",null,"__.__","Uhr","__"]
[{"$f":"A109+1","v":70},"7-4",">",{"$f":"VLOOKUP(LEFT($B110,SEARCH(\"-\",$B110)-1),$O$2:$P$10,2,FALSE)","v":"Team 7"},"-",{"$f":"VLOOKUP(RIGHT($B110,LEN($B110)-SEARCH(\"-\",$B110)),$O$2:$P$10,2,FALSE)","v":"Team 4"},"Sa/So",null,"__.__","Uhr","__"]
[{"$f":"A110+1","v":71},"5-6",">",{"$f":"VLOOKUP(LEFT($B111,SEARCH(\"-\",$B111)-1),$O$2:$P$10,2,FALSE)","v":"Team 5"},"-",{"$f":"VLOOKUP(RIGHT($B111,LEN($B111)-SEARCH(\"-\",$B111)),$O$2:$P$10,2,FALSE)","v":"Team 6"},"Sa/So",null,"__.__","Uhr","__"]
[{"$f":"A111+1","v":72},"3-8",">",{"$f":"VLOOKUP(LEFT($B112,SEARCH(\"-\",$B112)-1),$O$2:$P$10,2,FALSE)","v":"Team 3"},"-",{"$f":"VLOOKUP(RIGHT($B112,LEN($B112)-SEARCH(\"-\",$B112)),$O$2:$P$10,2,FALSE)","v":"Team 8"},"Sa/So",null,"__.__","Uhr","__"]
[]
["Relegation: 01. – 03. Mai 2026"]
[]
["####   Mit   >   gekennzeichnete Mannschaften haben Heimrecht   ####"]

{"sheet":"WVV 10 auf 18 Einzelspiele","index":7,"n_rows":134,"n_cols":16,"rows_kept":134,"cut":false,"hidden":false,"merged":[]}
[{"$f":"\"WVV-Spielplan: \"&N1","v":"WVV-Spielplan: Liga x Frauen / Männer"},null,null,null,null,null,"Saison 2025/26",null,null,null,"Seite 1(2)",null,null,"Liga x Frauen / Männer"]
[null,null,null,null,null,null,null,null,null,null,"Halle",null,"1.","20./21. Sept. 2025 (Sonntag WVV-Pokal)","1","Team 1"]
["1.Spieltag",null,null,{"$f":"$N$2","v":"20./21. Sept. 2025 (Sonntag WVV-Pokal)"},null,null,null,null,null,null,null,null,"2.","04./05. Okt. 2025","2","Team 2"]
[1,"1-9",">",{"$f":"VLOOKUP(LEFT($B4,SEARCH(\"-\",$B4)-1),$O$2:$P$11,2,FALSE)","v":"Team 1"},"-",{"$f":"VLOOKUP(RIGHT($B4,LEN($B4)-SEARCH(\"-\",$B4)),$O$2:$P$11,2,FALSE)","v":"Team 9"},"Sa/So",null,"__.__","Uhr","__",null,"3.","11./12. Okt. 2025 (Sonntag WVV-Pokalfinale)","3","Team 3"]
[{"$f":"A4+1","v":2},"3-6",">",{"$f":"VLOOKUP(LEFT($B5,SEARCH(\"-\",$B5)-1),$O$2:$P$11,2,FALSE)","v":"Team 3"},"-",{"$f":"VLOOKUP(RIGHT($B5,LEN($B5)-SEARCH(\"-\",$B5)),$O$2:$P$11,2,FALSE)","v":"Team 6"},"Sa/So",null,"__.__","Uhr","__",null,"4.","18./19. Okt. 2025","4","Team 4"]
[{"$f":"A5+1","v":3},"5-4",">",{"$f":"VLOOKUP(LEFT($B6,SEARCH(\"-\",$B6)-1),$O$2:$P$11,2,FALSE)","v":"Team 5"},"-",{"$f":"VLOOKUP(RIGHT($B6,LEN($B6)-SEARCH(\"-\",$B6)),$O$2:$P$11,2,FALSE)","v":"Team 4"},"Sa/So",null,"__.__","Uhr","__",null,"5.","25./26. Okt. 2025","5","Team 5"]
[{"$f":"A6+1","v":4},"7-2",">",{"$f":"VLOOKUP(LEFT($B7,SEARCH(\"-\",$B7)-1),$O$2:$P$11,2,FALSE)","v":"Team 7"},"-",{"$f":"VLOOKUP(RIGHT($B7,LEN($B7)-SEARCH(\"-\",$B7)),$O$2:$P$11,2,FALSE)","v":"Team 2"},"Sa/So",null,"__.__","Uhr","__",null,"6.","01./02. Nov. 2025 (Samstag Allerheiligen Spielverbot bis 18.00 Uhr)","6","Team 6"]
[{"$f":"A7+1","v":5},"10-8",">",{"$f":"VLOOKUP(LEFT($B8,SEARCH(\"-\",$B8)-1),$O$2:$P$11,2,FALSE)","v":"Team 10"},"-",{"$f":"VLOOKUP(RIGHT($B8,LEN($B8)-SEARCH(\"-\",$B8)),$O$2:$P$11,2,FALSE)","v":"Team 8"},"Sa/So",null,"__.__","Uhr","__",null,"7.","15./16. Nov. 2025 (Sonntag Volkstrauertag Spielverbot bis 13.00 Uhr)","7","Team 7"]
[null,null,null,null,null,null,null,null,null,null,null,null,"8.","22. Nov. 2025 (Sonntag Totensonntag Spielverbot bis 18.00 Uhr)","8","Team 8"]
["2.Spieltag",null,null,{"$f":"$N$3","v":"04./05. Okt. 2025"},null,null,null,null,null,null,null,null,"9.","06./07. Dez. 2025","9","Team 9"]
[6,"2-5",">",{"$f":"VLOOKUP(LEFT($B11,SEARCH(\"-\",$B11)-1),$O$2:$P$11,2,FALSE)","v":"Team 2"},"-",{"$f":"VLOOKUP(RIGHT($B11,LEN($B11)-SEARCH(\"-\",$B11)),$O$2:$P$11,2,FALSE)","v":"Team 5"},"Sa/So",null,"__.__","Uhr","__",null,"10.","20./21. Dez. 2025","10","Team 10"]
[{"$f":"A11+1","v":7},"4-3",">",{"$f":"VLOOKUP(LEFT($B12,SEARCH(\"-\",$B12)-1),$O$2:$P$11,2,FALSE)","v":"Team 4"},"-",{"$f":"VLOOKUP(RIGHT($B12,LEN($B12)-SEARCH(\"-\",$B12)),$O$2:$P$11,2,FALSE)","v":"Team 3"},"Sa/So",null,"__.__","Uhr","__",null,"11.","10. Jan. 2026 (Sonntag Jugendspieltag)"]
[{"$f":"A12+1","v":8},"6-10",">",{"$f":"VLOOKUP(LEFT($B13,SEARCH(\"-\",$B13)-1),$O$2:$P$11,2,FALSE)","v":"Team 6"},"-",{"$f":"VLOOKUP(RIGHT($B13,LEN($B13)-SEARCH(\"-\",$B13)),$O$2:$P$11,2,FALSE)","v":"Team 10"},"Sa/So",null,"__.__","Uhr","__",null,"12.","17./18. Jan. 2026"]
[{"$f":"A13+1","v":9},"8-1",">",{"$f":"VLOOKUP(LEFT($B14,SEARCH(\"-\",$B14)-1),$O$2:$P$11,2,FALSE)","v":"Team 8"},"-",{"$f":"VLOOKUP(RIGHT($B14,LEN($B14)-SEARCH(\"-\",$B14)),$O$2:$P$11,2,FALSE)","v":"Team 1"},"Sa/So",null,"__.__","Uhr","__",null,"13.","24. Jan. 2026 (Sonntag Jugendspieltag)"]
[{"$f":"A14+1","v":10},"9-7",">",{"$f":"VLOOKUP(LEFT($B15,SEARCH(\"-\",$B15)-1),$O$2:$P$11,2,FALSE)","v":"Team 9"},"-",{"$f":"VLOOKUP(RIGHT($B15,LEN($B15)-SEARCH(\"-\",$B15)),$O$2:$P$11,2,FALSE)","v":"Team 7"},"Sa/So",null,"__.__","Uhr","__",null,"14.","31. Jan./01. Feb. 2026 (Sonntag 1. Runde Bezirkspokal bis OL)"]
[null,null,null,null,null,null,null,null,null,null,null,null,"15.","14./15. Feb. 2026 (Sonntag Karneval)"]
["3.Spieltag",null,null,{"$f":"$N$4","v":"11./12. Okt. 2025 (Sonntag WVV-Pokalfinale)"},null,null,null,null,null,null,null,null,"16.","21./22. Feb. 2026 (Sonntag 2. Runde Bezirkspokal)"]
[11,"1-7",">",{"$f":"VLOOKUP(LEFT($B18,SEARCH(\"-\",$B18)-1),$O$2:$P$11,2,FALSE)","v":"Team 1"},"-",{"$f":"VLOOKUP(RIGHT($B18,LEN($B18)-SEARCH(\"-\",$B18)),$O$2:$P$11,2,FALSE)","v":"Team 7"},"Sa/So",null,"__.__","Uhr","__",null,"17.","07./08. Mär. 2026"]
[{"$f":"A18+1","v":12},"3-2",">",{"$f":"VLOOKUP(LEFT($B19,SEARCH(\"-\",$B19)-1),$O$2:$P$11,2,FALSE)","v":"Team 3"},"-",{"$f":"VLOOKUP(RIGHT($B19,LEN($B19)-SEARCH(\"-\",$B19)),$O$2:$P$11,2,FALSE)","v":"Team 2"},"Sa/So",null,"__.__","Uhr","__",null,"18.","21./22. Mär. 2026"]
[{"$f":"A19+1","v":13},"5-9",">",{"$f":"VLOOKUP(LEFT($B20,SEARCH(\"-\",$B20)-1),$O$2:$P$11,2,FALSE)","v":"Team 5"},"-",{"$f":"VLOOKUP(RIGHT($B20,LEN($B20)-SEARCH(\"-\",$B20)),$O$2:$P$11,2,FALSE)","v":"Team 9"},"Sa/So",null,"__.__","Uhr","__"]
[{"$f":"A20+1","v":14},"8-6",">",{"$f":"VLOOKUP(LEFT($B21,SEARCH(\"-\",$B21)-1),$O$2:$P$11,2,FALSE)","v":"Team 8"},"-",{"$f":"VLOOKUP(RIGHT($B21,LEN($B21)-SEARCH(\"-\",$B21)),$O$2:$P$11,2,FALSE)","v":"Team 6"},"Sa/So",null,"__.__","Uhr","__"]
[{"$f":"A21+1","v":15},"10-4",">",{"$f":"VLOOKUP(LEFT($B22,SEARCH(\"-\",$B22)-1),$O$2:$P$11,2,FALSE)","v":"Team 10"},"-",{"$f":"VLOOKUP(RIGHT($B22,LEN($B22)-SEARCH(\"-\",$B22)),$O$2:$P$11,2,FALSE)","v":"Team 4"},"Sa/So",null,"__.__","Uhr","__"]
[]
["4.Spieltag",null,null,{"$f":"$N$5","v":"18./19. Okt. 2025"}]
[16,"2-10",">",{"$f":"VLOOKUP(LEFT($B25,SEARCH(\"-\",$B25)-1),$O$2:$P$11,2,FALSE)","v":"Team 2"},"-",{"$f":"VLOOKUP(RIGHT($B25,LEN($B25)-SEARCH(\"-\",$B25)),$O$2:$P$11,2,FALSE)","v":"Team 10"},"Sa/So",null,"__.__","Uhr","__"]
[{"$f":"A25+1","v":17},"4-8",">",{"$f":"VLOOKUP(LEFT($B26,SEARCH(\"-\",$B26)-1),$O$2:$P$11,2,FALSE)","v":"Team 4"},"-",{"$f":"VLOOKUP(RIGHT($B26,LEN($B26)-SEARCH(\"-\",$B26)),$O$2:$P$11,2,FALSE)","v":"Team 8"},"Sa/So",null,"__.__","Uhr","__"]
[{"$f":"A26+1","v":18},"6-1",">",{"$f":"VLOOKUP(LEFT($B27,SEARCH(\"-\",$B27)-1),$O$2:$P$11,2,FALSE)","v":"Team 6"},"-",{"$f":"VLOOKUP(RIGHT($B27,LEN($B27)-SEARCH(\"-\",$B27)),$O$2:$P$11,2,FALSE)","v":"Team 1"},"Sa/So",null,"__.__","Uhr","__"]
[{"$f":"A27+1","v":19},"7-5",">",{"$f":"VLOOKUP(LEFT($B28,SEARCH(\"-\",$B28)-1),$O$2:$P$11,2,FALSE)","v":"Team 7"},"-",{"$f":"VLOOKUP(RIGHT($B28,LEN($B28)-SEARCH(\"-\",$B28)),$O$2:$P$11,2,FALSE)","v":"Team 5"},"Sa/So",null,"__.__","Uhr","__"]
[{"$f":"A28+1","v":20},"9-3",">",{"$f":"VLOOKUP(LEFT($B29,SEARCH(\"-\",$B29)-1),$O$2:$P$11,2,FALSE)","v":"Team 9"},"-",{"$f":"VLOOKUP(RIGHT($B29,LEN($B29)-SEARCH(\"-\",$B29)),$O$2:$P$11,2,FALSE)","v":"Team 3"},"Sa/So",null,"__.__","Uhr","__"]
[]
["5.Spieltag",null,null,{"$f":"$N$6","v":"25./26. Okt. 2025"}]
[21,"1-5",">",{"$f":"VLOOKUP(LEFT($B32,SEARCH(\"-\",$B32)-1),$O$2:$P$11,2,FALSE)","v":"Team 1"},"-",{"$f":"VLOOKUP(RIGHT($B32,LEN($B32)-SEARCH(\"-\",$B32)),$O$2:$P$11,2,FALSE)","v":"Team 5"},"Sa/So",null,"__.__","Uhr","__"]
[{"$f":"A32+1","v":22},"3-7",">",{"$f":"VLOOKUP(LEFT($B33,SEARCH(\"-\",$B33)-1),$O$2:$P$11,2,FALSE)","v":"Team 3"},"-",{"$f":"VLOOKUP(RIGHT($B33,LEN($B33)-SEARCH(\"-\",$B33)),$O$2:$P$11,2,FALSE)","v":"Team 7"},"Sa/So",null,"__.__","Uhr","__"]
[{"$f":"A33+1","v":23},"6-4",">",{"$f":"VLOOKUP(LEFT($B34,SEARCH(\"-\",$B34)-1),$O$2:$P$11,2,FALSE)","v":"Team 6"},"-",{"$f":"VLOOKUP(RIGHT($B34,LEN($B34)-SEARCH(\"-\",$B34)),$O$2:$P$11,2,FALSE)","v":"Team 4"},"Sa/So",null,"__.__","Uhr","__"]
[{"$f":"A34+1","v":24},"8-2",">",{"$f":"VLOOKUP(LEFT($B35,SEARCH(\"-\",$B35)-1),$O$2:$P$11,2,FALSE)","v":"Team 8"},"-",{"$f":"VLOOKUP(RIGHT($B35,LEN($B35)-SEARCH(\"-\",$B35)),$O$2:$P$11,2,FALSE)","v":"Team 2"},"Sa/So",null,"__.__","Uhr","__"]
[{"$f":"A35+1","v":25},"10-9",">",{"$f":"VLOOKUP(LEFT($B36,SEARCH(\"-\",$B36)-1),$O$2:$P$11,2,FALSE)","v":"Team 10"},"-",{"$f":"VLOOKUP(RIGHT($B36,LEN($B36)-SEARCH(\"-\",$B36)),$O$2:$P$11,2,FALSE)","v":"Team 9"},"Sa/So",null,"__.__","Uhr","__"]
[]
["6.Spieltag",null,null,{"$f":"$N$7","v":"01./02. Nov. 2025 (Samstag Allerheiligen Spielverbot bis 18.00 Uhr)"}]
[26,"2-6",">",{"$f":"VLOOKUP(LEFT($B39,SEARCH(\"-\",$B39)-1),$O$2:$P$11,2,FALSE)","v":"Team 2"},"-",{"$f":"VLOOKUP(RIGHT($B39,LEN($B39)-SEARCH(\"-\",$B39)),$O$2:$P$11,2,FALSE)","v":"Team 6"},"So",null,"__.__","Uhr","__"]
[{"$f":"A39+1","v":27},"4-1",">",{"$f":"VLOOKUP(LEFT($B40,SEARCH(\"-\",$B40)-1),$O$2:$P$11,2,FALSE)","v":"Team 4"},"-",{"$f":"VLOOKUP(RIGHT($B40,LEN($B40)-SEARCH(\"-\",$B40)),$O$2:$P$11,2,FALSE)","v":"Team 1"},"So",null,"__.__","Uhr","__"]
[{"$f":"A40+1","v":28},"5-3",">",{"$f":"VLOOKUP(LEFT($B41,SEARCH(\"-\",$B41)-1),$O$2:$P$11,2,FALSE)","v":"Team 5"},"-",{"$f":"VLOOKUP(RIGHT($B41,LEN($B41)-SEARCH(\"-\",$B41)),$O$2:$P$11,2,FALSE)","v":"Team 3"},"So",null,"__.__","Uhr","__"]
[{"$f":"A41+1","v":29},"7-10",">",{"$f":"VLOOKUP(LEFT($B42,SEARCH(\"-\",$B42)-1),$O$2:$P$11,2,FALSE)","v":"Team 7"},"-",{"$f":"VLOOKUP(RIGHT($B42,LEN($B42)-SEARCH(\"-\",$B42)),$O$2:$P$11,2,FALSE)","v":"Team 10"},"So",null,"__.__","Uhr","__"]
[{"$f":"A42+1","v":30},"9-8",">",{"$f":"VLOOKUP(LEFT($B43,SEARCH(\"-\",$B43)-1),$O$2:$P$11,2,FALSE)","v":"Team 9"},"-",{"$f":"VLOOKUP(RIGHT($B43,LEN($B43)-SEARCH(\"-\",$B43)),$O$2:$P$11,2,FALSE)","v":"Team 8"},"So",null,"__.__","Uhr","__"]
[]
["7.Spieltag",null,null,{"$f":"$N$8","v":"15./16. Nov. 2025 (Sonntag Volkstrauertag Spielverbot bis 13.00 Uhr)"}]
[31,"1-3",">",{"$f":"VLOOKUP(LEFT($B46,SEARCH(\"-\",$B46)-1),$O$2:$P$11,2,FALSE)","v":"Team 1"},"-",{"$f":"VLOOKUP(RIGHT($B46,LEN($B46)-SEARCH(\"-\",$B46)),$O$2:$P$11,2,FALSE)","v":"Team 3"},"Sa/So",null,"__.__","Uhr","__"]
[{"$f":"A46+1","v":32},"4-2",">",{"$f":"VLOOKUP(LEFT($B47,SEARCH(\"-\",$B47)-1),$O$2:$P$11,2,FALSE)","v":"Team 4"},"-",{"$f":"VLOOKUP(RIGHT($B47,LEN($B47)-SEARCH(\"-\",$B47)),$O$2:$P$11,2,FALSE)","v":"Team 2"},"Sa/So",null,"__.__","Uhr","__"]
[{"$f":"A47+1","v":33},"6-9",">",{"$f":"VLOOKUP(LEFT($B48,SEARCH(\"-\",$B48)-1),$O$2:$P$11,2,FALSE)","v":"Team 6"},"-",{"$f":"VLOOKUP(RIGHT($B48,LEN($B48)-SEARCH(\"-\",$B48)),$O$2:$P$11,2,FALSE)","v":"Team 9"},"Sa/So",null,"__.__","Uhr","__"]
[{"$f":"A48+1","v":34},"8-7",">",{"$f":"VLOOKUP(LEFT($B49,SEARCH(\"-\",$B49)-1),$O$2:$P$11,2,FALSE)","v":"Team 8"},"-",{"$f":"VLOOKUP(RIGHT($B49,LEN($B49)-SEARCH(\"-\",$B49)),$O$2:$P$11,2,FALSE)","v":"Team 7"},"Sa/So",null,"__.__","Uhr","__"]
[{"$f":"A49+1","v":35},"10-5",">",{"$f":"VLOOKUP(LEFT($B50,SEARCH(\"-\",$B50)-1),$O$2:$P$11,2,FALSE)","v":"Team 10"},"-",{"$f":"VLOOKUP(RIGHT($B50,LEN($B50)-SEARCH(\"-\",$B50)),$O$2:$P$11,2,FALSE)","v":"Team 5"},"Sa/So",null,"__.__","Uhr","__"]
[]
["8.Spieltag",null,null,{"$f":"$N$9","v":"22. Nov. 2025 (Sonntag Totensonntag Spielverbot bis 18.00 Uhr)"}]
[36,"1-2",">",{"$f":"VLOOKUP(LEFT($B53,SEARCH(\"-\",$B53)-1),$O$2:$P$11,2,FALSE)","v":"Team 1"},"-",{"$f":"VLOOKUP(RIGHT($B53,LEN($B53)-SEARCH(\"-\",$B53)),$O$2:$P$11,2,FALSE)","v":"Team 2"},"Sa",null,"__.__","Uhr","__"]
[{"$f":"A53+1","v":37},"3-10",">",{"$f":"VLOOKUP(LEFT($B54,SEARCH(\"-\",$B54)-1),$O$2:$P$11,2,FALSE)","v":"Team 3"},"-",{"$f":"VLOOKUP(RIGHT($B54,LEN($B54)-SEARCH(\"-\",$B54)),$O$2:$P$11,2,FALSE)","v":"Team 10"},"Sa",null,"__.__","Uhr","__"]
[{"$f":"A54+1","v":38},"5-8",">",{"$f":"VLOOKUP(LEFT($B55,SEARCH(\"-\",$B55)-1),$O$2:$P$11,2,FALSE)","v":"Team 5"},"-",{"$f":"VLOOKUP(RIGHT($B55,LEN($B55)-SEARCH(\"-\",$B55)),$O$2:$P$11,2,FALSE)","v":"Team 8"},"Sa",null,"__.__","Uhr","__"]
[{"$f":"A55+1","v":39},"7-6",">",{"$f":"VLOOKUP(LEFT($B56,SEARCH(\"-\",$B56)-1),$O$2:$P$11,2,FALSE)","v":"Team 7"},"-",{"$f":"VLOOKUP(RIGHT($B56,LEN($B56)-SEARCH(\"-\",$B56)),$O$2:$P$11,2,FALSE)","v":"Team 6"},"Sa",null,"__.__","Uhr","__"]
[{"$f":"A56+1","v":40},"9-4",">",{"$f":"VLOOKUP(LEFT($B57,SEARCH(\"-\",$B57)-1),$O$2:$P$11,2,FALSE)","v":"Team 9"},"-",{"$f":"VLOOKUP(RIGHT($B57,LEN($B57)-SEARCH(\"-\",$B57)),$O$2:$P$11,2,FALSE)","v":"Team 4"},"Sa",null,"__.__","Uhr","__"]
[]
["9.Spieltag",null,null,{"$f":"$N$10","v":"06./07. Dez. 2025"}]
[41,"2-9",">",{"$f":"VLOOKUP(LEFT($B60,SEARCH(\"-\",$B60)-1),$O$2:$P$11,2,FALSE)","v":"Team 2"},"-",{"$f":"VLOOKUP(RIGHT($B60,LEN($B60)-SEARCH(\"-\",$B60)),$O$2:$P$11,2,FALSE)","v":"Team 9"},"Sa/So",null,"__.__","Uhr","__"]
[{"$f":"A60+1","v":42},"4-7",">",{"$f":"VLOOKUP(LEFT($B61,SEARCH(\"-\",$B61)-1),$O$2:$P$11,2,FALSE)","v":"Team 4"},"-",{"$f":"VLOOKUP(RIGHT($B61,LEN($B61)-SEARCH(\"-\",$B61)),$O$2:$P$11,2,FALSE)","v":"Team 7"},"Sa/So",null,"__.__","Uhr","__"]
[{"$f":"A61+1","v":43},"6-5",">",{"$f":"VLOOKUP(LEFT($B62,SEARCH(\"-\",$B62)-1),$O$2:$P$11,2,FALSE)","v":"Team 6"},"-",{"$f":"VLOOKUP(RIGHT($B62,LEN($B62)-SEARCH(\"-\",$B62)),$O$2:$P$11,2,FALSE)","v":"Team 5"},"Sa/So",null,"__.__","Uhr","__"]
[{"$f":"A62+1","v":44},"8-3",">",{"$f":"VLOOKUP(LEFT($B63,SEARCH(\"-\",$B63)-1),$O$2:$P$11,2,FALSE)","v":"Team 8"},"-",{"$f":"VLOOKUP(RIGHT($B63,LEN($B63)-SEARCH(\"-\",$B63)),$O$2:$P$11,2,FALSE)","v":"Team 3"},"Sa/So",null,"__.__","Uhr","__"]
[{"$f":"A63+1","v":45},"10-1",">",{"$f":"VLOOKUP(LEFT($B64,SEARCH(\"-\",$B64)-1),$O$2:$P$11,2,FALSE)","v":"Team 10"},"-",{"$f":"VLOOKUP(RIGHT($B64,LEN($B64)-SEARCH(\"-\",$B64)),$O$2:$P$11,2,FALSE)","v":"Team 1"},"Sa/So",null,"__.__","Uhr","__"]
[]
["####   Mit   >   gekennzeichnete Mannschaften haben Heimrecht   ####"]
[{"$f":"A1","v":"WVV-Spielplan: Liga x Frauen / Männer"},null,null,null,null,null,{"$f":"G1","v":"Saison 2025/26"},null,null,null,"Seite 2(2)"]
[null,null,null,null,null,null,null,null,null,null,"Halle"]
["10.Spieltag",null,null,{"$f":"$N$11","v":"20./21. Dez. 2025"}]
[46,"9-1",">",{"$f":"VLOOKUP(LEFT($B70,SEARCH(\"-\",$B70)-1),$O$2:$P$11,2,FALSE)","v":"Team 9"},"-",{"$f":"VLOOKUP(RIGHT($B70,LEN($B70)-SEARCH(\"-\",$B70)),$O$2:$P$11,2,FALSE)","v":"Team 1"},"Sa/So",null,"__.__","Uhr","__"]
[{"$f":"A70+1","v":47},"6-3",">",{"$f":"VLOOKUP(LEFT($B71,SEARCH(\"-\",$B71)-1),$O$2:$P$11,2,FALSE)","v":"Team 6"},"-",{"$f":"VLOOKUP(RIGHT($B71,LEN($B71)-SEARCH(\"-\",$B71)),$O$2:$P$11,2,FALSE)","v":"Team 3"},"Sa/So",null,"__.__","Uhr","__"]
[{"$f":"A71+1","v":48},"4-5",">",{"$f":"VLOOKUP(LEFT($B72,SEARCH(\"-\",$B72)-1),$O$2:$P$11,2,FALSE)","v":"Team 4"},"-",{"$f":"VLOOKUP(RIGHT($B72,LEN($B72)-SEARCH(\"-\",$B72)),$O$2:$P$11,2,FALSE)","v":"Team 5"},"Sa/So",null,"__.__","Uhr","__"]
[{"$f":"A72+1","v":49},"2-7",">",{"$f":"VLOOKUP(LEFT($B73,SEARCH(\"-\",$B73)-1),$O$2:$P$11,2,FALSE)","v":"Team 2"},"-",{"$f":"VLOOKUP(RIGHT($B73,LEN($B73)-SEARCH(\"-\",$B73)),$O$2:$P$11,2,FALSE)","v":"Team 7"},"Sa/So",null,"__.__","Uhr","__"]
[{"$f":"A73+1","v":50},"8-10",">",{"$f":"VLOOKUP(LEFT($B74,SEARCH(\"-\",$B74)-1),$O$2:$P$11,2,FALSE)","v":"Team 8"},"-",{"$f":"VLOOKUP(RIGHT($B74,LEN($B74)-SEARCH(\"-\",$B74)),$O$2:$P$11,2,FALSE)","v":"Team 10"},"Sa/So",null,"__.__","Uhr","__"]
[]
["11.Spieltag",null,null,{"$f":"$N$12","v":"10. Jan. 2026 (Sonntag Jugendspieltag)"}]
[51,"5-2",">",{"$f":"VLOOKUP(LEFT($B77,SEARCH(\"-\",$B77)-1),$O$2:$P$11,2,FALSE)","v":"Team 5"},"-",{"$f":"VLOOKUP(RIGHT($B77,LEN($B77)-SEARCH(\"-\",$B77)),$O$2:$P$11,2,FALSE)","v":"Team 2"},"Sa",null,"__.__","Uhr","__"]
[{"$f":"A77+1","v":52},"3-4",">",{"$f":"VLOOKUP(LEFT($B78,SEARCH(\"-\",$B78)-1),$O$2:$P$11,2,FALSE)","v":"Team 3"},"-",{"$f":"VLOOKUP(RIGHT($B78,LEN($B78)-SEARCH(\"-\",$B78)),$O$2:$P$11,2,FALSE)","v":"Team 4"},"Sa",null,"__.__","Uhr","__"]
[{"$f":"A78+1","v":53},"10-6",">",{"$f":"VLOOKUP(LEFT($B79,SEARCH(\"-\",$B79)-1),$O$2:$P$11,2,FALSE)","v":"Team 10"},"-",{"$f":"VLOOKUP(RIGHT($B79,LEN($B79)-SEARCH(\"-\",$B79)),$O$2:$P$11,2,FALSE)","v":"Team 6"},"Sa",null,"__.__","Uhr","__"]
[{"$f":"A79+1","v":54},"1-8",">",{"$f":"VLOOKUP(LEFT($B80,SEARCH(\"-\",$B80)-1),$O$2:$P$11,2,FALSE)","v":"Team 1"},"-",{"$f":"VLOOKUP(RIGHT($B80,LEN($B80)-SEARCH(\"-\",$B80)),$O$2:$P$11,2,FALSE)","v":"Team 8"},"Sa",null,"__.__","Uhr","__"]
[{"$f":"A80+1","v":55},"7-9",">",{"$f":"VLOOKUP(LEFT($B81,SEARCH(\"-\",$B81)-1),$O$2:$P$11,2,FALSE)","v":"Team 7"},"-",{"$f":"VLOOKUP(RIGHT($B81,LEN($B81)-SEARCH(\"-\",$B81)),$O$2:$P$11,2,FALSE)","v":"Team 9"},"Sa",null,"__.__","Uhr","__"]
[]
["12.Spieltag",null,null,{"$f":"$N$13","v":"17./18. Jan. 2026"}]
[56,"7-1",">",{"$f":"VLOOKUP(LEFT($B84,SEARCH(\"-\",$B84)-1),$O$2:$P$11,2,FALSE)","v":"Team 7"},"-",{"$f":"VLOOKUP(RIGHT($B84,LEN($B84)-SEARCH(\"-\",$B84)),$O$2:$P$11,2,FALSE)","v":"Team 1"},"Sa/So",null,"__.__","Uhr","__"]
[{"$f":"A84+1","v":57},"2-3",">",{"$f":"VLOOKUP(LEFT($B85,SEARCH(\"-\",$B85)-1),$O$2:$P$11,2,FALSE)","v":"Team 2"},"-",{"$f":"VLOOKUP(RIGHT($B85,LEN($B85)-SEARCH(\"-\",$B85)),$O$2:$P$11,2,FALSE)","v":"Team 3"},"Sa/So",null,"__.__","Uhr","__"]
[{"$f":"A85+1","v":58},"9-5",">",{"$f":"VLOOKUP(LEFT($B86,SEARCH(\"-\",$B86)-1),$O$2:$P$11,2,FALSE)","v":"Team 9"},"-",{"$f":"VLOOKUP(RIGHT($B86,LEN($B86)-SEARCH(\"-\",$B86)),$O$2:$P$11,2,FALSE)","v":"Team 5"},"Sa/So",null,"__.__","Uhr","__"]
[{"$f":"A86+1","v":59},"6-8",">",{"$f":"VLOOKUP(LEFT($B87,SEARCH(\"-\",$B87)-1),$O$2:$P$11,2,FALSE)","v":"Team 6"},"-",{"$f":"VLOOKUP(RIGHT($B87,LEN($B87)-SEARCH(\"-\",$B87)),$O$2:$P$11,2,FALSE)","v":"Team 8"},"Sa/So",null,"__.__","Uhr","__"]
[{"$f":"A87+1","v":60},"4-10",">",{"$f":"VLOOKUP(LEFT($B88,SEARCH(\"-\",$B88)-1),$O$2:$P$11,2,FALSE)","v":"Team 4"},"-",{"$f":"VLOOKUP(RIGHT($B88,LEN($B88)-SEARCH(\"-\",$B88)),$O$2:$P$11,2,FALSE)","v":"Team 10"},"Sa/So",null,"__.__","Uhr","__"]
[]
["13.Spieltag",null,null,{"$f":"$N$14","v":"24. Jan. 2026 (Sonntag Jugendspieltag)"}]
[61,"10-2",">",{"$f":"VLOOKUP(LEFT($B91,SEARCH(\"-\",$B91)-1),$O$2:$P$11,2,FALSE)","v":"Team 10"},"-",{"$f":"VLOOKUP(RIGHT($B91,LEN($B91)-SEARCH(\"-\",$B91)),$O$2:$P$11,2,FALSE)","v":"Team 2"},"Sa",null,"__.__","Uhr","__"]
[{"$f":"A91+1","v":62},"8-4",">",{"$f":"VLOOKUP(LEFT($B92,SEARCH(\"-\",$B92)-1),$O$2:$P$11,2,FALSE)","v":"Team 8"},"-",{"$f":"VLOOKUP(RIGHT($B92,LEN($B92)-SEARCH(\"-\",$B92)),$O$2:$P$11,2,FALSE)","v":"Team 4"},"Sa",null,"__.__","Uhr","__"]
[{"$f":"A92+1","v":63},"1-6",">",{"$f":"VLOOKUP(LEFT($B93,SEARCH(\"-\",$B93)-1),$O$2:$P$11,2,FALSE)","v":"Team 1"},"-",{"$f":"VLOOKUP(RIGHT($B93,LEN($B93)-SEARCH(\"-\",$B93)),$O$2:$P$11,2,FALSE)","v":"Team 6"},"Sa",null,"__.__","Uhr","__"]
[{"$f":"A93+1","v":64},"5-7",">",{"$f":"VLOOKUP(LEFT($B94,SEARCH(\"-\",$B94)-1),$O$2:$P$11,2,FALSE)","v":"Team 5"},"-",{"$f":"VLOOKUP(RIGHT($B94,LEN($B94)-SEARCH(\"-\",$B94)),$O$2:$P$11,2,FALSE)","v":"Team 7"},"Sa",null,"__.__","Uhr","__"]
[{"$f":"A94+1","v":65},"3-9",">",{"$f":"VLOOKUP(LEFT($B95,SEARCH(\"-\",$B95)-1),$O$2:$P$11,2,FALSE)","v":"Team 3"},"-",{"$f":"VLOOKUP(RIGHT($B95,LEN($B95)-SEARCH(\"-\",$B95)),$O$2:$P$11,2,FALSE)","v":"Team 9"},"Sa",null,"__.__","Uhr","__"]
[]
["14.Spieltag",null,null,{"$f":"$N$15","v":"31. Jan./01. Feb. 2026 (Sonntag 1. Runde Bezirkspokal bis OL)"}]
[66,"5-1",">",{"$f":"VLOOKUP(LEFT($B98,SEARCH(\"-\",$B98)-1),$O$2:$P$11,2,FALSE)","v":"Team 5"},"-",{"$f":"VLOOKUP(RIGHT($B98,LEN($B98)-SEARCH(\"-\",$B98)),$O$2:$P$11,2,FALSE)","v":"Team 1"},"Sa/So",null,"__.__","Uhr","__"]
[{"$f":"A98+1","v":67},"7-3",">",{"$f":"VLOOKUP(LEFT($B99,SEARCH(\"-\",$B99)-1),$O$2:$P$11,2,FALSE)","v":"Team 7"},"-",{"$f":"VLOOKUP(RIGHT($B99,LEN($B99)-SEARCH(\"-\",$B99)),$O$2:$P$11,2,FALSE)","v":"Team 3"},"Sa/So",null,"__.__","Uhr","__"]
[{"$f":"A99+1","v":68},"4-6",">",{"$f":"VLOOKUP(LEFT($B100,SEARCH(\"-\",$B100)-1),$O$2:$P$11,2,FALSE)","v":"Team 4"},"-",{"$f":"VLOOKUP(RIGHT($B100,LEN($B100)-SEARCH(\"-\",$B100)),$O$2:$P$11,2,FALSE)","v":"Team 6"},"Sa/So",null,"__.__","Uhr","__"]
[{"$f":"A100+1","v":69},"2-8",">",{"$f":"VLOOKUP(LEFT($B101,SEARCH(\"-\",$B101)-1),$O$2:$P$11,2,FALSE)","v":"Team 2"},"-",{"$f":"VLOOKUP(RIGHT($B101,LEN($B101)-SEARCH(\"-\",$B101)),$O$2:$P$11,2,FALSE)","v":"Team 8"},"Sa/So",null,"__.__","Uhr","__"]
[{"$f":"A101+1","v":70},"9-10",">",{"$f":"VLOOKUP(LEFT($B102,SEARCH(\"-\",$B102)-1),$O$2:$P$11,2,FALSE)","v":"Team 9"},"-",{"$f":"VLOOKUP(RIGHT($B102,LEN($B102)-SEARCH(\"-\",$B102)),$O$2:$P$11,2,FALSE)","v":"Team 10"},"Sa/So",null,"__.__","Uhr","__"]
[]
["15.Spieltag",null,null,{"$f":"$N$16","v":"14./15. Feb. 2026 (Sonntag Karneval)"}]
[71,"6-2",">",{"$f":"VLOOKUP(LEFT($B105,SEARCH(\"-\",$B105)-1),$O$2:$P$11,2,FALSE)","v":"Team 6"},"-",{"$f":"VLOOKUP(RIGHT($B105,LEN($B105)-SEARCH(\"-\",$B105)),$O$2:$P$11,2,FALSE)","v":"Team 2"},"Sa/So",null,"__.__","Uhr","__"]
[{"$f":"A105+1","v":72},"1-4",">",{"$f":"VLOOKUP(LEFT($B106,SEARCH(\"-\",$B106)-1),$O$2:$P$11,2,FALSE)","v":"Team 1"},"-",{"$f":"VLOOKUP(RIGHT($B106,LEN($B106)-SEARCH(\"-\",$B106)),$O$2:$P$11,2,FALSE)","v":"Team 4"},"Sa/So",null,"__.__","Uhr","__"]
[{"$f":"A106+1","v":73},"3-5",">",{"$f":"VLOOKUP(LEFT($B107,SEARCH(\"-\",$B107)-1),$O$2:$P$11,2,FALSE)","v":"Team 3"},"-",{"$f":"VLOOKUP(RIGHT($B107,LEN($B107)-SEARCH(\"-\",$B107)),$O$2:$P$11,2,FALSE)","v":"Team 5"},"Sa/So",null,"__.__","Uhr","__"]
[{"$f":"A107+1","v":74},"10-7",">",{"$f":"VLOOKUP(LEFT($B108,SEARCH(\"-\",$B108)-1),$O$2:$P$11,2,FALSE)","v":"Team 10"},"-",{"$f":"VLOOKUP(RIGHT($B108,LEN($B108)-SEARCH(\"-\",$B108)),$O$2:$P$11,2,FALSE)","v":"Team 7"},"Sa/So",null,"__.__","Uhr","__"]
[{"$f":"A108+1","v":75},"8-9",">",{"$f":"VLOOKUP(LEFT($B109,SEARCH(\"-\",$B109)-1),$O$2:$P$11,2,FALSE)","v":"Team 8"},"-",{"$f":"VLOOKUP(RIGHT($B109,LEN($B109)-SEARCH(\"-\",$B109)),$O$2:$P$11,2,FALSE)","v":"Team 9"},"Sa/So",null,"__.__","Uhr","__"]
[]
["16.Spieltag",null,null,{"$f":"$N$17","v":"21./22. Feb. 2026 (Sonntag 2. Runde Bezirkspokal)"}]
[76,"3-1",">",{"$f":"VLOOKUP(LEFT($B112,SEARCH(\"-\",$B112)-1),$O$2:$P$11,2,FALSE)","v":"Team 3"},"-",{"$f":"VLOOKUP(RIGHT($B112,LEN($B112)-SEARCH(\"-\",$B112)),$O$2:$P$11,2,FALSE)","v":"Team 1"},"Sa/So",null,"__.__","Uhr","__"]
[{"$f":"A112+1","v":77},"2-4",">",{"$f":"VLOOKUP(LEFT($B113,SEARCH(\"-\",$B113)-1),$O$2:$P$11,2,FALSE)","v":"Team 2"},"-",{"$f":"VLOOKUP(RIGHT($B113,LEN($B113)-SEARCH(\"-\",$B113)),$O$2:$P$11,2,FALSE)","v":"Team 4"},"Sa/So",null,"__.__","Uhr","__"]
[{"$f":"A113+1","v":78},"9-6",">",{"$f":"VLOOKUP(LEFT($B114,SEARCH(\"-\",$B114)-1),$O$2:$P$11,2,FALSE)","v":"Team 9"},"-",{"$f":"VLOOKUP(RIGHT($B114,LEN($B114)-SEARCH(\"-\",$B114)),$O$2:$P$11,2,FALSE)","v":"Team 6"},"Sa/So",null,"__.__","Uhr","__"]
[{"$f":"A114+1","v":79},"7-8",">",{"$f":"VLOOKUP(LEFT($B115,SEARCH(\"-\",$B115)-1),$O$2:$P$11,2,FALSE)","v":"Team 7"},"-",{"$f":"VLOOKUP(RIGHT($B115,LEN($B115)-SEARCH(\"-\",$B115)),$O$2:$P$11,2,FALSE)","v":"Team 8"},"Sa/So",null,"__.__","Uhr","__"]
[{"$f":"A115+1","v":80},"5-10",">",{"$f":"VLOOKUP(LEFT($B116,SEARCH(\"-\",$B116)-1),$O$2:$P$11,2,FALSE)","v":"Team 5"},"-",{"$f":"VLOOKUP(RIGHT($B116,LEN($B116)-SEARCH(\"-\",$B116)),$O$2:$P$11,2,FALSE)","v":"Team 10"},"Sa/So",null,"__.__","Uhr","__"]
[]
["17.Spieltag",null,null,{"$f":"$N$18","v":"07./08. Mär. 2026"}]
[81,"2-1",">",{"$f":"VLOOKUP(LEFT($B119,SEARCH(\"-\",$B119)-1),$O$2:$P$11,2,FALSE)","v":"Team 2"},"-",{"$f":"VLOOKUP(RIGHT($B119,LEN($B119)-SEARCH(\"-\",$B119)),$O$2:$P$11,2,FALSE)","v":"Team 1"},"Sa/So",null,"__.__","Uhr","__"]
[{"$f":"A119+1","v":82},"10-3",">",{"$f":"VLOOKUP(LEFT($B120,SEARCH(\"-\",$B120)-1),$O$2:$P$11,2,FALSE)","v":"Team 10"},"-",{"$f":"VLOOKUP(RIGHT($B120,LEN($B120)-SEARCH(\"-\",$B120)),$O$2:$P$11,2,FALSE)","v":"Team 3"},"Sa/So",null,"__.__","Uhr","__"]
[{"$f":"A120+1","v":83},"8-5",">",{"$f":"VLOOKUP(LEFT($B121,SEARCH(\"-\",$B121)-1),$O$2:$P$11,2,FALSE)","v":"Team 8"},"-",{"$f":"VLOOKUP(RIGHT($B121,LEN($B121)-SEARCH(\"-\",$B121)),$O$2:$P$11,2,FALSE)","v":"Team 5"},"Sa/So",null,"__.__","Uhr","__"]
[{"$f":"A121+1","v":84},"6-7",">",{"$f":"VLOOKUP(LEFT($B122,SEARCH(\"-\",$B122)-1),$O$2:$P$11,2,FALSE)","v":"Team 6"},"-",{"$f":"VLOOKUP(RIGHT($B122,LEN($B122)-SEARCH(\"-\",$B122)),$O$2:$P$11,2,FALSE)","v":"Team 7"},"Sa/So",null,"__.__","Uhr","__"]
[{"$f":"A122+1","v":85},"4-9",">",{"$f":"VLOOKUP(LEFT($B123,SEARCH(\"-\",$B123)-1),$O$2:$P$11,2,FALSE)","v":"Team 4"},"-",{"$f":"VLOOKUP(RIGHT($B123,LEN($B123)-SEARCH(\"-\",$B123)),$O$2:$P$11,2,FALSE)","v":"Team 9"},"Sa/So",null,"__.__","Uhr","__"]
[]
["18.Spieltag",null,null,{"$f":"$N$19","v":"21./22. Mär. 2026"}]
[86,"9-2",">",{"$f":"VLOOKUP(LEFT($B126,SEARCH(\"-\",$B126)-1),$O$2:$P$11,2,FALSE)","v":"Team 9"},"-",{"$f":"VLOOKUP(RIGHT($B126,LEN($B126)-SEARCH(\"-\",$B126)),$O$2:$P$11,2,FALSE)","v":"Team 2"},"Sa/So",null,"__.__","Uhr","__"]
[{"$f":"A126+1","v":87},"7-4",">",{"$f":"VLOOKUP(LEFT($B127,SEARCH(\"-\",$B127)-1),$O$2:$P$11,2,FALSE)","v":"Team 7"},"-",{"$f":"VLOOKUP(RIGHT($B127,LEN($B127)-SEARCH(\"-\",$B127)),$O$2:$P$11,2,FALSE)","v":"Team 4"},"Sa/So",null,"__.__","Uhr","__"]
[{"$f":"A127+1","v":88},"5-6",">",{"$f":"VLOOKUP(LEFT($B128,SEARCH(\"-\",$B128)-1),$O$2:$P$11,2,FALSE)","v":"Team 5"},"-",{"$f":"VLOOKUP(RIGHT($B128,LEN($B128)-SEARCH(\"-\",$B128)),$O$2:$P$11,2,FALSE)","v":"Team 6"},"Sa/So",null,"__.__","Uhr","__"]
[{"$f":"A128+1","v":89},"3-8",">",{"$f":"VLOOKUP(LEFT($B129,SEARCH(\"-\",$B129)-1),$O$2:$P$11,2,FALSE)","v":"Team 3"},"-",{"$f":"VLOOKUP(RIGHT($B129,LEN($B129)-SEARCH(\"-\",$B129)),$O$2:$P$11,2,FALSE)","v":"Team 8"},"Sa/So",null,"__.__","Uhr","__"]
[{"$f":"A129+1","v":90},"1-10",">",{"$f":"VLOOKUP(LEFT($B130,SEARCH(\"-\",$B130)-1),$O$2:$P$11,2,FALSE)","v":"Team 1"},"-",{"$f":"VLOOKUP(RIGHT($B130,LEN($B130)-SEARCH(\"-\",$B130)),$O$2:$P$11,2,FALSE)","v":"Team 10"},"Sa/So",null,"__.__","Uhr","__"]
[]
["Relegation: 01. – 03. Mai 2026"]
[]
["####   Mit   >   gekennzeichnete Mannschaften haben Heimrecht   ####"]